StructureMap.group.rule.rule.source.logMessage
type: ObjectProperty
comment: A FHIRPath expression which specifies a message to put in the transform log when content matching the source rule is found.
domain: StructureMapGroupComponent.StructureMapGroupRuleComponentRule.StructureMapGroupRuleSourceComponent
range: string
title: Message to put in log if source exists (FHIRPath)

MedicinalProductClinicals.contraindication.diseaseStatus
type: ObjectProperty
comment: The status of the disease or symptom for the contraindication.
domain: MedicinalProductClinicalsContraindicationComponent
range: CodeableConcept
title: The status of the disease or symptom for the contraindication

ClinicalImpression.date
type: ObjectProperty
comment: Indicates when the documentation of the assessment was complete.
domain: ClinicalImpression
range: dateTime
sub property of: when.recorded
title: When the assessment was documented

ImmunizationRecommendation.recommendation.doseNumberPositiveInt
type: ObjectProperty
domain: ImmunizationRecommendationRecommendationComponent
range: positiveInt
sub property of: ImmunizationRecommendation.recommendation.doseNumber

What happens in each alternative option
type: Class
comment: What happens in each alternative option.
label: ExampleScenarioProcessComponent.ExampleScenarioProcessStepComponent.ExampleScenarioProcessStepAlternativeComponent.ExampleScenarioProcessStepAlternativeOptionComponentStepProcess.ExampleScenarioProcessStepComponent.ExampleScenarioProcessStepAlternativeComponent.ExampleScenarioProcessStepAlternativeOptionComponentStep
subclass of: BackboneElement

ExampleScenario.process.step.process.step.alternative.name
type: ObjectProperty
comment: The name of each alternative.
domain: ExampleScenarioProcessComponent.ExampleScenarioProcessStepComponentProcess.ExampleScenarioProcessStepComponent.ExampleScenarioProcessStepAlternativeComponent
range: string
title: The name of each alternative

List.subject
type: ObjectProperty
comment: The common subject (or patient) of the resources that are in the list if there is one.
domain: List
range: Reference
sub property of: who.focus
title: If all resources have the same subject

decimal
type: Class
comment: A rational number with implicit precision
subclass of: Primitive
subclass of: Restriction
  cardinality: 1
  on property: fhir:value
  some values from: Datatype
    on datatype: decimal

Observation.valueSampledData
type: ObjectProperty
domain: Observation
range: SampledData
sub property of: Observation.value

DataRequirement.dateFilter.value
type: ObjectProperty

MessageDefinition.date
type: ObjectProperty
comment: The date (and optionally time) when the message definition was published. The date must change when the business version changes and it must change if the status code changes. In addition, it should change when the substantive content of the message definition changes.
domain: MessageDefinition
range: dateTime
sub property of: when.recorded
title: Date last changed

MedicinalProductPharmaceutical.routeOfAdministration.targetSpecies.withdrawalPeriod
type: ObjectProperty
comment: A species specific time during which consumption of animal product is not appropriate.
domain: MedicinalProductPharmaceuticalRouteOfAdministrationComponent.MedicinalProductPharmaceuticalRouteOfAdministrationTargetSpeciesComponent
range: MedicinalProductPharmaceuticalRouteOfAdministrationComponent.MedicinalProductPharmaceuticalRouteOfAdministrationTargetSpeciesComponent.MedicinalProductPharmaceuticalRouteOfAdministrationTargetSpeciesWithdrawalPeriodComponent
title: A species specific time during which consumption of animal product is not appropriate

ContactPoint.value
type: ObjectProperty
comment: The actual contact point details, in a form that is meaningful to the designated communication system (i.e. phone number or email address).
domain: ContactPoint
range: string
title: The actual contact point details

Claim.provider
type: ObjectProperty
comment: The provider which is responsible for the bill, claim pre-determination, pre-authorization.
domain: Claim
range: Reference
sub property of: who.source
title: Responsible provider

ClaimResponse.addItem.detail.subDetail.adjudication.amount
type: ObjectProperty
comment: Monetary amount associated with the code.
domain: ClaimResponse.AddedItemComponent.AddedItemDetailComponent.AddedItemSubDetailComponentAdjudication
range: Money
title: Monetary amount

Questionnaire.item.enableWhen.answer
type: ObjectProperty

RequestGroup.action.description
type: ObjectProperty
comment: A short description of the action used to provide a summary to display to the user.
domain: RequestGroupActionComponent
range: string
title: Short description of the action

PlanDefinition.action.action.timing
type: ObjectProperty

Substance.instance
type: ObjectProperty
comment: Substance may be used to describe a kind of substance, or a specific package/container of the substance: an instance.
domain: Substance
range: SubstanceInstanceComponent
title: If this describes a specific package/container of the substance

Contract.url
type: ObjectProperty
comment: Canonical identifier for this contract, represented as a URI (globally unique).
domain: Contract
range: uri
title: Basal definition

Medication
type: Class
comment: This resource is primarily used for the identification and definition of a medication for the purposes of prescribing, dispensing, and administering a medication as well as for making statements about medication use.
subclass of: DomainResource
subclass of: clinical.medication
subclass of: Restriction
  all values from: MedicationBatchComponent
  max cardinality: 1
  on property: Medication.batch
subclass of: Restriction
  all values from: SimpleQuantity
  max cardinality: 1
  on property: Medication.amount
subclass of: Restriction
  all values from: CodeableConcept
  max cardinality: 1
  on property: Medication.form
subclass of: Restriction
  all values from: code
  max cardinality: 1
  on property: Medication.status
subclass of: Restriction
  all values from: Reference
  max cardinality: 1
  on property: Medication.manufacturer
subclass of: Restriction
  all values from: CodeableConcept
  max cardinality: 1
  on property: Medication.code
subclass of: Restriction
  all values from: MedicationIngredientComponent
  on property: Medication.ingredient

Contract.term.securityLabel.classification
type: ObjectProperty
comment: Security label privacy tag that species the level of confidentiality protection required for this term and/or term elements.
domain: Contract.TermComponent.SecurityLabelComponent
range: Coding
title: Confidentiality Protection

ExplanationOfBenefit.provider
type: ObjectProperty
comment: The provider which is responsible for the claim.
domain: ExplanationOfBenefit
range: Reference
sub property of: who.source
title: Responsible provider for the claim

Composition.subject
type: ObjectProperty
comment: Who or what the composition is about. The composition can be about a person, (patient or healthcare practitioner), a device (e.g. a machine) or even a group of subjects (such as a document about a herd of livestock, or a set of patients that share a common exposure).
domain: Composition
range: Reference
sub property of: who.focus
title: Who and/or what the composition is about

DeviceDefinition.material.substance
type: ObjectProperty
comment: The substance.
domain: DeviceDefinitionMaterialComponent
range: CodeableConcept
title: The substance

MedicationKnowledge.kinetics
type: ObjectProperty
comment: The time course of drug absorption, distribution, metabolism and excretion of a medication from the body.
domain: MedicationKnowledge
range: MedicationKnowledgeKineticsComponent
title: The time course of drug absorption, distribution, metabolism and excretion of a medication from the body

NutritionOrder.enteralFormula.maxVolumeToDeliver
type: ObjectProperty
comment: The maximum total quantity of formula that may be administered to a subject over the period of time, e.g. 1440 mL over 24 hours.
domain: NutritionOrderEnteralFormulaComponent
range: SimpleQuantity
title: Upper limit on formula volume per unit of time

MedicinalProduct.combinedPharmaceuticalDoseForm
type: ObjectProperty
comment: The dose form for a single part product, or combined form of a multiple part product.
domain: MedicinalProduct
range: CodeableConcept
title: The dose form for a single part product, or combined form of a multiple part product

CapabilityStatementRestComponent.CapabilityStatementRestResourceComponent.CapabilityStatementRestResourceSearchParamComponent
type: Class
comment: Search parameters for implementations to support and/or make use of - either references to ones defined in the specification, or additional ones defined for/by the implementation.
subclass of: BackboneElement
subclass of: Restriction
  all values from: markdown
  max cardinality: 1
  on property: CapabilityStatement.rest.resource.searchParam.documentation
subclass of: Restriction
  cardinality: 1
  on property: CapabilityStatement.rest.resource.searchParam.type
  some values from: code
subclass of: Restriction
  all values from: canonical
  max cardinality: 1
  on property: CapabilityStatement.rest.resource.searchParam.definition
subclass of: Restriction
  cardinality: 1
  on property: CapabilityStatement.rest.resource.searchParam.name
  some values from: string

Questionnaire.item.initial.valueCoding
type: ObjectProperty
domain: QuestionnaireItemComponent.QuestionnaireItemInitialComponent
range: Coding
sub property of: Questionnaire.item.initial.value

StructureDefinition.copyright
type: ObjectProperty
comment: A copyright statement relating to the structure definition and/or its contents. Copyright statements are generally legal restrictions on the use and publishing of the structure definition.
domain: StructureDefinition
range: markdown
title: Use and/or publishing restrictions

TestScript.setup.action.operation.resource
type: ObjectProperty
comment: The type of the resource. See http://build.fhir.org/resourcelist.html.
domain: TestScriptSetupComponent.SetupActionComponent.SetupActionOperationComponent
range: code
title: Resource type

CoverageEligibilityRequest.item.diagnosis.diagnosisCodeableConcept
type: ObjectProperty
domain: CoverageEligibilityRequest.DetailsComponent.DiagnosisComponent
range: CodeableConcept
sub property of: CoverageEligibilityRequest.item.diagnosis.diagnosis

NutritionOrder.oralDiet.fluidConsistencyType
type: ObjectProperty
comment: The required consistency (e.g. honey-thick, nectar-thick, thin, thickened.) of liquids or fluids served to the patient.
domain: NutritionOrderOralDietComponent
range: CodeableConcept
title: The required consistency of fluids and liquids provided to the patient

CommunicationRequest.doNotPerform
type: ObjectProperty
comment: If true indicates that the CommunicationRequest is asking for the specified action to *not* occur.
domain: CommunicationRequest
range: boolean
title: True if request is prohibiting action

RequestGroup.status
type: ObjectProperty
comment: The current state of the request. For request groups, the status reflects the status of all the requests in the group.
domain: RequestGroup
range: code
sub property of: status
title: draft | active | suspended | cancelled | completed | entered-in-error | unknown

ExplanationOfBenefit.information.valueBoolean
type: ObjectProperty
domain: ExplanationOfBenefit.SupportingInformationComponent
range: boolean
sub property of: ExplanationOfBenefit.information.value

ExplanationOfBenefit.item.careTeamSequence
type: ObjectProperty
comment: Careteam applicable for this service or product line.
domain: ExplanationOfBenefit.ItemComponent
range: positiveInt
title: Applicable careteam members

TestScript.setup.action.assert.navigationLinks
type: ObjectProperty
comment: Whether or not the test execution performs validation on the bundle navigation links.
domain: TestScriptSetupComponent.SetupActionComponent.SetupActionAssertComponent
range: boolean
title: Perform validation on navigation links?

MessageDefinition.category
type: ObjectProperty
comment: The impact of the content of the message.
domain: MessageDefinition
range: code
title: consequence | currency | notification

CapabilityStatement.rest.searchParam.name
type: ObjectProperty
comment: The name of the search parameter used in the interface.
domain: CapabilityStatementRestComponentSearchParam
range: string
title: Name of search parameter

Condition.abatementDateTime
type: ObjectProperty
domain: Condition
range: dateTime
sub property of: Condition.abatement

AllergyIntolerance.reaction.severity
type: ObjectProperty
comment: Clinical assessment of the severity of the reaction event as a whole, potentially considering multiple different manifestations.
domain: AllergyIntoleranceReactionComponent
range: code
title: mild | moderate | severe (of event as a whole)

StructureMapGroupComponent.StructureMapGroupRuleComponent
type: Class
comment: Transform Rule from source to target.
subclass of: BackboneElement
subclass of: Restriction
  all values from: StructureMapGroupComponent.StructureMapGroupRuleComponent.StructureMapGroupRuleDependentComponent
  on property: StructureMap.group.rule.dependent
subclass of: Restriction
  all values from: StructureMapGroupComponent.StructureMapGroupRuleComponent.StructureMapGroupRuleTargetComponent
  on property: StructureMap.group.rule.target
subclass of: Restriction
  all values from: string
  max cardinality: 1
  on property: StructureMap.group.rule.documentation
subclass of: Restriction
  cardinality: 1
  on property: StructureMap.group.rule.name
  some values from: id
subclass of: Restriction
  on property: StructureMap.group.rule.source
  some values from: StructureMapGroupComponent.StructureMapGroupRuleComponent.StructureMapGroupRuleSourceComponent
subclass of: Restriction
  all values from: StructureMapGroupComponent.StructureMapGroupRuleComponentRule
  on property: StructureMap.group.rule.rule

FamilyMemberHistory.born
type: ObjectProperty

ExampleScenario.process.step.process.step.alternative
type: ObjectProperty
comment: Each interaction in the workflow.
domain: ExampleScenarioProcessComponent.ExampleScenarioProcessStepComponentProcess.ExampleScenarioProcessStepComponent
range: ExampleScenarioProcessComponent.ExampleScenarioProcessStepComponentProcess.ExampleScenarioProcessStepComponent.ExampleScenarioProcessStepAlternativeComponent
title: Each interaction in the process

VisionPrescription.dateWritten
type: ObjectProperty
comment: The date (and perhaps time) when the prescription was written.
domain: VisionPrescription
range: dateTime
sub property of: when.recorded
title: When prescription was authorized

GuidanceResponse.performer
type: ObjectProperty
comment: Provides a reference to the device that performed the guidance.
domain: GuidanceResponse
range: Reference
sub property of: who.actor
title: Device returning the guidance

Consent.provision.provision.class
type: ObjectProperty
comment: The class of information covered by this rule. The type can be a FHIR resource type, a profile on a type, or a CDA document, or some other type that indicates what sort of information the consent relates to.
domain: Consent.provisionComponentProvision
range: Coding
title: e.g. Resource Type, Profile, CDA, etc.

StructureMap.group.rule.rule.target.contextType
type: ObjectProperty
comment: How to interpret the context.
domain: StructureMapGroupComponent.StructureMapGroupRuleComponentRule.StructureMapGroupRuleTargetComponent
range: code
title: type | variable

ExplanationOfBenefit.addItem.detail.adjudication.value
type: ObjectProperty
comment: A non-monetary value for example a percentage. Mutually exclusive to the amount element above.
domain: ExplanationOfBenefit.AddedItemComponent.AddedItemDetailComponentAdjudication
range: decimal
title: Non-monitory value

MedicinalProductPharmaceutical.routeOfAdministration.firstDose
type: ObjectProperty
comment: The first dose (dose quantity) administered in humans can be specified, for a product under investigation, using a numerical value and its unit of measurement.
domain: MedicinalProductPharmaceuticalRouteOfAdministrationComponent
range: Quantity
title: The first dose (dose quantity) administered in humans can be specified, for a product under investigation, using a numerical value and its unit of measurement

ProcessRequest.created
type: ObjectProperty
comment: The date when this resource was created.
domain: ProcessRequest
range: dateTime
sub property of: when.recorded
title: Creation date

ElementDefinition.slicing.description
type: ObjectProperty
comment: A human-readable text description of how the slicing works. If there is no discriminator, this is required to be present to provide whatever information is possible about how the slices can be differentiated.
domain: ElementDefinitionSlicingComponent
range: string
title: Text description of how slicing works (or not)

ValueSet.expansion.parameter.valueDecimal
type: ObjectProperty
domain: ValueSetExpansionComponent.ValueSetExpansionParameterComponent
range: decimal
sub property of: ValueSet.expansion.parameter.value

AuditEventAgentComponent.AuditEventAgentNetworkComponent
type: Class
comment: Logical network location for application activity, if the activity has a network location.
subclass of: BackboneElement
subclass of: Restriction
  all values from: code
  max cardinality: 1
  on property: AuditEvent.agent.network.type
subclass of: Restriction
  all values from: string
  max cardinality: 1
  on property: AuditEvent.agent.network.address

Communication.recipient
type: ObjectProperty
comment: The entity (e.g. person, organization, clinical information system, care team or device) which was the target of the communication. If receipts need to be tracked by individual, a separate resource instance will need to be created for each recipient. Multiple recipient communications are intended where either a receipt(s) is not tracked (e.g. a mass mail-out) or is captured in aggregate (all emails confirmed received by a particular time).
domain: Communication
range: Reference
sub property of: who.actor
title: Message recipient

CoverageEligibilityRequest.item.modifier
type: ObjectProperty
comment: Item typification or modifiers codes, e.g. for Oral whether the treatment is cosmetic or associated with TMJ, or for medical whether the treatment was outside the clinic or out of office hours.
domain: CoverageEligibilityRequest.DetailsComponent
range: CodeableConcept
title: Service/Product billing modifiers

VerificationResult.validator.signedValidatorAttestation
type: ObjectProperty

Patient.telecom
type: ObjectProperty
comment: A contact detail (e.g. a telephone number or an email address) by which the individual may be contacted.
domain: Patient
range: ContactPoint
title: A contact detail for the individual

MedicinalProductClinicals.interactions
type: ObjectProperty
comment: The interactions of the medicinal product with other medicinal products, or other forms of interactions.
domain: MedicinalProductClinicals
range: MedicinalProductClinicalsInteractionsComponent
title: The interactions of the medicinal product with other medicinal products, or other forms of interactions

CoverageEligibilityRequest.supportingInformation.sequence
type: ObjectProperty
comment: Sequence of the information element which serves to provide a link.
domain: CoverageEligibilityRequest.InformationComponent
range: positiveInt
title: Information instance identifier

TestScript.teardown.action.operation.resource
type: ObjectProperty
comment: The type of the resource. See http://build.fhir.org/resourcelist.html.
domain: TestScriptTeardownComponent.TeardownActionComponentOperation
range: code
title: Resource type

ExplanationOfBenefit.AddedItemComponent.AddedItemDetailComponent.AddedItemDetailSubDetailComponent
type: Class
comment: The third-tier service adjudications for payor added services.
subclass of: BackboneElement
subclass of: Restriction
  all values from: positiveInt
  on property: ExplanationOfBenefit.addItem.detail.subDetail.noteNumber
subclass of: Restriction
  all values from: SimpleQuantity
  max cardinality: 1
  on property: ExplanationOfBenefit.addItem.detail.subDetail.quantity
subclass of: Restriction
  all values from: decimal
  max cardinality: 1
  on property: ExplanationOfBenefit.addItem.detail.subDetail.factor
subclass of: Restriction
  all values from: Money
  max cardinality: 1
  on property: ExplanationOfBenefit.addItem.detail.subDetail.unitPrice
subclass of: Restriction
  all values from: Money
  max cardinality: 1
  on property: ExplanationOfBenefit.addItem.detail.subDetail.net
subclass of: Restriction
  all values from: CodeableConcept
  max cardinality: 1
  on property: ExplanationOfBenefit.addItem.detail.subDetail.billcode
subclass of: Restriction
  all values from: CodeableConcept
  on property: ExplanationOfBenefit.addItem.detail.subDetail.modifier
subclass of: Restriction
  all values from: ExplanationOfBenefit.AddedItemComponent.AddedItemDetailComponent.AddedItemDetailSubDetailComponentAdjudication
  on property: ExplanationOfBenefit.addItem.detail.subDetail.adjudication

BiologicallyDerivedProduct.parent
type: ObjectProperty
comment: Parent product (if any).
domain: BiologicallyDerivedProduct
range: Reference
title: BiologicallyDerivedProduct parent

Task.for
type: ObjectProperty
comment: The entity who benefits from the performance of the service specified in the task (e.g., the patient).
domain: Task
range: Reference
sub property of: who.focus
title: Beneficiary of the Task

ConceptMap.purpose
type: ObjectProperty
comment: Explanation of why this concept map is needed and why it has been designed as it has.
domain: ConceptMap
range: markdown
sub property of: why
title: Why this concept map is defined

QuestionnaireResponse.item.item.answer.value
type: ObjectProperty

ExplanationOfBenefit.ItemComponent.DetailComponent.SubDetailComponent
type: Class
comment: Third-tier of goods and services.
subclass of: BackboneElement
subclass of: Restriction
  all values from: SimpleQuantity
  max cardinality: 1
  on property: ExplanationOfBenefit.item.detail.subDetail.quantity
subclass of: Restriction
  all values from: Money
  max cardinality: 1
  on property: ExplanationOfBenefit.item.detail.subDetail.unitPrice
subclass of: Restriction
  all values from: decimal
  max cardinality: 1
  on property: ExplanationOfBenefit.item.detail.subDetail.factor
subclass of: Restriction
  all values from: ExplanationOfBenefit.ItemComponent.DetailComponent.SubDetailComponentAdjudication
  on property: ExplanationOfBenefit.item.detail.subDetail.adjudication
subclass of: Restriction
  all values from: CodeableConcept
  on property: ExplanationOfBenefit.item.detail.subDetail.modifier
subclass of: Restriction
  all values from: CodeableConcept
  max cardinality: 1
  on property: ExplanationOfBenefit.item.detail.subDetail.category
subclass of: Restriction
  all values from: CodeableConcept
  max cardinality: 1
  on property: ExplanationOfBenefit.item.detail.subDetail.billcode
subclass of: Restriction
  all values from: positiveInt
  on property: ExplanationOfBenefit.item.detail.subDetail.noteNumber
subclass of: Restriction
  all values from: Money
  max cardinality: 1
  on property: ExplanationOfBenefit.item.detail.subDetail.net
subclass of: Restriction
  all values from: Reference
  on property: ExplanationOfBenefit.item.detail.subDetail.udi
subclass of: Restriction
  cardinality: 1
  on property: ExplanationOfBenefit.item.detail.subDetail.sequence
  some values from: positiveInt
subclass of: Restriction
  all values from: CodeableConcept
  on property: ExplanationOfBenefit.item.detail.subDetail.programCode
subclass of: Restriction
  all values from: CodeableConcept
  max cardinality: 1
  on property: ExplanationOfBenefit.item.detail.subDetail.revenue

TestScript.test.action.assert.path
type: ObjectProperty
comment: The XPath or JSONPath expression to be evaluated against the fixture representing the response received from server.
domain: TestScriptTestComponent.TestActionComponentAssert
range: string
title: XPath or JSONPath expression

AppointmentResponse.participantType
type: ObjectProperty
comment: Role of participant in the appointment.
domain: AppointmentResponse
range: CodeableConcept
title: Role of participant in the appointment

CapabilityStatement.title
type: ObjectProperty
comment: A short, descriptive, user-friendly title for the capability statement.
domain: CapabilityStatement
range: string
title: Name for this capability statement (human friendly)

Encounter.episodeOfCare
type: ObjectProperty
comment: Where a specific encounter should be classified as a part of a specific episode(s) of care this field should be used. This association can facilitate grouping of related encounters together for a specific purpose, such as government reporting, issue tracking, association via a common problem. The association is recorded on the encounter as these are typically created after the episode of care, and grouped on entry rather than editing the episode of care to append another encounter to it (the episode of care could span years).
domain: Encounter
range: Reference
sub property of: context
title: Episode(s) of care that this encounter should be recorded against

PaymentNotice.provider
type: ObjectProperty
comment: The practitioner who is responsible for the services rendered to the patient.
domain: PaymentNotice
range: Reference
sub property of: who.source
title: Responsible practitioner

ResearchStudy.relatedArtifact
type: ObjectProperty
comment: Citations, references and other related documents.
domain: ResearchStudy
range: RelatedArtifact
title: References and dependencies

Sequence.variant.start
type: ObjectProperty
comment: Start position of the variant on the reference sequence.If the coordinate system is either 0-based or 1-based, then start position is inclusive.
domain: SequenceVariantComponent
range: integer
title: Start position of the variant on the reference sequence

Consent.provisionComponentProvisionProvision
type: Class
comment: Rules which provide exceptions to the base rule or subrules.
subclass of: BackboneElement
title: Nested Exception Rules

ValueSetComposeComponent.ConceptSetComponent.ConceptReferenceComponent
type: Class
comment: Specifies a concept to be included or excluded.
subclass of: BackboneElement
subclass of: Restriction
  all values from: ValueSetComposeComponent.ConceptSetComponent.ConceptReferenceComponent.ConceptReferenceDesignationComponent
  on property: ValueSet.compose.include.concept.designation
subclass of: Restriction
  all values from: string
  max cardinality: 1
  on property: ValueSet.compose.include.concept.display
subclass of: Restriction
  cardinality: 1
  on property: ValueSet.compose.include.concept.code
  some values from: code

ExampleScenario.process.step.alternative.option.step.process.step.alternative.option.pause
type: ObjectProperty
comment: If there is a pause in the flow.
domain: ExampleScenarioProcessComponent.ExampleScenarioProcessStepComponent.ExampleScenarioProcessStepAlternativeComponent.ExampleScenarioProcessStepAlternativeOptionComponentStepProcess.ExampleScenarioProcessStepComponent.ExampleScenarioProcessStepAlternativeComponent.ExampleScenarioProcessStepAlternativeOptionComponent
range: boolean
title: If there is a pause in the flow

Specimen.status
type: ObjectProperty
comment: The availability of the specimen.
domain: Specimen
range: code
sub property of: status
title: available | unavailable | unsatisfactory | entered-in-error

CapabilityStatementImplementationComponent
type: Class
comment: Identifies a specific implementation instance that is described by the capability statement - i.e. a particular installation, rather than the capabilities of a software program.
subclass of: BackboneElement
subclass of: Restriction
  all values from: Reference
  max cardinality: 1
  on property: CapabilityStatement.implementation.custodian
subclass of: Restriction
  all values from: url
  max cardinality: 1
  on property: CapabilityStatement.implementation.url
subclass of: Restriction
  cardinality: 1
  on property: CapabilityStatement.implementation.description
  some values from: string

ClaimResponse.ErrorComponent
type: Class
comment: Mutually exclusive with Services Provided (Item).
subclass of: BackboneElement
subclass of: Restriction
  cardinality: 1
  on property: ClaimResponse.error.code
  some values from: CodeableConcept
subclass of: Restriction
  all values from: positiveInt
  max cardinality: 1
  on property: ClaimResponse.error.subDetailSequence
subclass of: Restriction
  all values from: positiveInt
  max cardinality: 1
  on property: ClaimResponse.error.detailSequence
subclass of: Restriction
  all values from: positiveInt
  max cardinality: 1
  on property: ClaimResponse.error.itemSequence

Specimen.container.capacity
type: ObjectProperty
comment: The capacity (volume or other measure) the container may contain.
domain: SpecimenContainerComponent
range: SimpleQuantity
title: Container volume or size

TestScript.test.action.assert.rule.ruleId
type: ObjectProperty
comment: The TestScript.rule id value this assert will evaluate.
domain: TestScriptTestComponent.TestActionComponentAssert.ActionAssertRuleComponent
range: id
title: Id of the TestScript.rule

CoverageEligibilityRequest.created
type: ObjectProperty
comment: The date when this resource was created.
domain: CoverageEligibilityRequest
range: dateTime
sub property of: when.recorded
title: Creation date

ExplanationOfBenefit.ItemComponent.DetailComponentAdjudication
type: Class
comment: The adjudication results.
subclass of: BackboneElement
subclass of: Restriction
  all values from: decimal
  max cardinality: 1
  on property: ExplanationOfBenefit.item.detail.adjudication.value
subclass of: Restriction
  all values from: Money
  max cardinality: 1
  on property: ExplanationOfBenefit.item.detail.adjudication.amount
subclass of: Restriction
  all values from: CodeableConcept
  max cardinality: 1
  on property: ExplanationOfBenefit.item.detail.adjudication.reason
subclass of: Restriction
  cardinality: 1
  on property: ExplanationOfBenefit.item.detail.adjudication.category
  some values from: CodeableConcept
title: Detail level adjudication details

BiologicallyDerivedProduct.processing.procedure
type: ObjectProperty
comment: Procesing code.
domain: BiologicallyDerivedProductProcessingComponent
range: CodeableConcept
title: Procesing code

Claim.item.detail.subDetail.udi
type: ObjectProperty
comment: List of Unique Device Identifiers associated with this line item.
domain: Claim.ItemComponent.DetailComponent.SubDetailComponent
range: Reference
title: Unique Device Identifier

Contract.term.group.asset.text
type: ObjectProperty
comment: Clause or question text (Prose Object) concerning the asset in a linked form, such as a QuestionnaireResponse used in the formation of the contract.
domain: Contract.TermComponentTerm.ContractAssetComponent
range: string
title: Asset clause or question text

CarePlan.activity.detail.description
type: ObjectProperty
comment: This provides a textual description of constraints on the intended activity occurrence, including relation to other activities. It may also include objectives, pre-conditions and end-conditions. Finally, it may convey specifics about the activity such as body site, method, route, etc.
domain: CarePlanActivityComponent.CarePlanActivityDetailComponent
range: string
title: Extra info describing activity to perform

Questionnaire.item.item
type: ObjectProperty
comment: Text, questions and other groups to be nested beneath a question or group.
domain: QuestionnaireItemComponent
range: QuestionnaireItemComponentItem
title: Nested questionnaire items

SupplyRequest.deliverTo
type: ObjectProperty
comment: Where the supply is destined to go.
domain: SupplyRequest
range: Reference
title: The destination of the supply

SubstancePolymerRepeatComponent.SubstancePolymerRepeatRepeatUnitComponent
type: Class
comment: Todo.
subclass of: BackboneElement
subclass of: Restriction
  all values from: SubstancePolymerRepeatComponent.SubstancePolymerRepeatRepeatUnitComponent.SubstancePolymerRepeatRepeatUnitStructuralRepresentationComponent
  on property: SubstancePolymer.repeat.repeatUnit.structuralRepresentation
subclass of: Restriction
  all values from: SubstancePolymerRepeatComponent.SubstancePolymerRepeatRepeatUnitComponent.SubstancePolymerRepeatRepeatUnitDegreeOfPolymerisationComponent
  on property: SubstancePolymer.repeat.repeatUnit.degreeOfPolymerisation
subclass of: Restriction
  all values from: SubstanceAmount
  max cardinality: 1
  on property: SubstancePolymer.repeat.repeatUnit.amount
subclass of: Restriction
  all values from: string
  max cardinality: 1
  on property: SubstancePolymer.repeat.repeatUnit.repeatUnit
subclass of: Restriction
  all values from: CodeableConcept
  max cardinality: 1
  on property: SubstancePolymer.repeat.repeatUnit.orientationOfPolymerisation

HumanName.text
type: ObjectProperty
comment: Specifies the entire name as it should be displayed e.g. on an application UI. This may be provided instead of or as well as the specific parts.
domain: HumanName
range: string
title: Text representation of the full name

Contract.term.group.action.linkId
type: ObjectProperty
comment: Id [identifier??] of the clause or question text related to this action in the referenced form or QuestionnaireResponse.
domain: Contract.TermComponentTerm.ActionComponent
range: string
title: Pointer to specific item

MedicationKnowledge.monitoringProgram.name
type: ObjectProperty
comment: Name of the reviewing program.
domain: MedicationKnowledgeMonitoringProgramComponent
range: string
title: Name of the reviewing program

ObservationDefinition.quantitativeDetails.unit
type: ObjectProperty
comment: SI unit used to report quantitative results of this observation.
domain: ObservationDefinitionQuantitativeDetailsComponent
range: Coding
title: SI unit for quantitative results

ExampleScenario.process.step.process.step.alternative.option.step.operation.initiatorActive
type: ObjectProperty
comment: Whether the initiator is deactivated right after the transaction.
domain: ExampleScenarioProcessComponent.ExampleScenarioProcessStepComponentProcess.ExampleScenarioProcessStepComponent.ExampleScenarioProcessStepAlternativeComponent.ExampleScenarioProcessStepAlternativeOptionComponentStep.ExampleScenarioProcessStepOperationComponent
range: boolean
title: Whether the initiator is deactivated right after the transaction

ElementDefinition.orderMeaning
type: ObjectProperty
comment: If present, indicates that the order of the repeating element has meaning and describes what that meaning is. If absent, it means that the order of the element has no meaning.
domain: ElementDefinition
range: string
title: What the order of the elements means

ImmunizationRecommendation.recommendation.vaccineCode
type: ObjectProperty
comment: Vaccine(s) or vaccine group that pertain to the recommendation.
domain: ImmunizationRecommendationRecommendationComponent
range: CodeableConcept
title: Vaccine or vaccine group recommendation applies to

SupplyRequest.authoredOn
type: ObjectProperty
comment: When the request was made.
domain: SupplyRequest
range: dateTime
sub property of: when.recorded
title: When the request was made

Invoice.totalPriceComponent.code
type: ObjectProperty
comment: A code that identifies the component. Codes may be used to differentiate between kinds of taxes, surcharges, discounts etc.
domain: InvoicePriceComponent
range: CodeableConcept
title: Code identifying the specific component

ExplanationOfBenefit.claim
type: ObjectProperty
comment: The business identifier for the instance: invoice number, claim number, pre-determination or pre-authorization number.
domain: ExplanationOfBenefit
range: Reference
sub property of: why
title: Claim reference

EventDefinition.reviewer
type: ObjectProperty
comment: An individual or organization primarily responsible for review of some aspect of the content.
domain: EventDefinition
range: ContactDetail
title: Who reviewed the content

ExampleScenario.process.step.alternative.option.step.process.preConditions
type: ObjectProperty
comment: Description of initial status before the process starts.
domain: ExampleScenarioProcessComponent.ExampleScenarioProcessStepComponent.ExampleScenarioProcessStepAlternativeComponent.ExampleScenarioProcessStepAlternativeOptionComponentStepProcess
range: markdown
title: Description of initial status before the process starts

RelatedPerson.telecom
type: ObjectProperty
comment: A contact detail for the person, e.g. a telephone number or an email address.
domain: RelatedPerson
range: ContactPoint
title: A contact detail for the person

GraphDefinition.link.description
type: ObjectProperty
comment: Information about why this link is of interest in this graph definition.
domain: GraphDefinitionLinkComponent
range: string
title: Why this link is specified

ExplanationOfBenefit.diagnosis.diagnosisCodeableConcept
type: ObjectProperty
domain: ExplanationOfBenefit.DiagnosisComponent
range: CodeableConcept
sub property of: ExplanationOfBenefit.diagnosis.diagnosis

GraphDefinition.link.target.link.target.type
type: ObjectProperty
comment: Type of resource this link refers to.
domain: GraphDefinitionLinkComponent.GraphDefinitionLinkTargetComponentLink.GraphDefinitionLinkTargetComponent
range: code
title: Type of resource this link refers to

ImplementationGuide.jurisdiction
type: ObjectProperty
comment: A legal or geographic region in which the implementation guide is intended to be used.
domain: ImplementationGuide
range: CodeableConcept
title: Intended jurisdiction for implementation guide (if applicable)

MedicationAdministration.dosage.method
type: ObjectProperty
comment: A coded value indicating the method by which the medication is intended to be or was introduced into or on the body. This attribute will most often NOT be populated. It is most commonly used for injections. For example, Slow Push, Deep IV.
domain: MedicationAdministrationDosageComponent
range: CodeableConcept
title: How drug was administered

CarePlan.status
type: ObjectProperty
comment: Indicates whether the plan is currently being acted upon, represents future intentions or is now a historical record.
domain: CarePlan
range: code
sub property of: status
title: draft | active | suspended | completed | entered-in-error | cancelled | unknown

SearchParameter.multipleAnd
type: ObjectProperty
comment: Whether multiple parameters are allowed - e.g. more than one parameter with the same name. The search matches if all the parameters match.
domain: SearchParameter
range: boolean
title: Allow multiple parameters (and)

Library.approvalDate
type: ObjectProperty
comment: The date on which the resource content was approved by the publisher. Approval happens once when the content is officially approved for usage.
domain: Library
range: date
title: When the library was approved by publisher

MedicationDispense.daysSupply
type: ObjectProperty
comment: The amount of medication expressed as a timing amount.
domain: MedicationDispense
range: SimpleQuantity
title: Amount of medication expressed as a timing amount

StructureDefinition.contact
type: ObjectProperty
comment: Contact details to assist a user in finding and communicating with the publisher.
domain: StructureDefinition
range: ContactDetail
title: Contact details for the publisher

ImplementationGuide.global.type
type: ObjectProperty
comment: The type of resource that all instances must conform to.
domain: ImplementationGuideGlobalComponent
range: code
title: Type this profile applies to

Claim.SpecialConditionComponent
type: Class
comment: Additional information codes regarding exceptions, special considerations, the condition, situation, prior or concurrent issues. Often there are multiple jurisdiction specific valuesets which are required.
subclass of: BackboneElement
subclass of: Restriction
  all values from: CodeableConcept
  max cardinality: 1
  on property: Claim.information.code
subclass of: Restriction
  cardinality: 1
  on property: Claim.information.sequence
  some values from: positiveInt
subclass of: Restriction
  all values from: CodeableConcept
  max cardinality: 1
  on property: Claim.information.reason
subclass of:
  union of: Restriction
    all values from: date
    max cardinality: 1
    on property: Claim.information.timingDate
  union of: Restriction
    all values from: Period
    max cardinality: 1
    on property: Claim.information.timingPeriod
subclass of: Restriction
  cardinality: 1
  on property: Claim.information.category
  some values from: CodeableConcept
subclass of:
  union of: Restriction
    all values from: boolean
    max cardinality: 1
    on property: Claim.information.valueBoolean
  union of: Restriction
    all values from: string
    max cardinality: 1
    on property: Claim.information.valueString
  union of: Restriction
    all values from: Quantity
    max cardinality: 1
    on property: Claim.information.valueQuantity
  union of: Restriction
    all values from: Attachment
    max cardinality: 1
    on property: Claim.information.valueAttachment
  union of: Restriction
    all values from: Reference
    max cardinality: 1
    on property: Claim.information.valueReference

MedicationKnowledge.doseForm
type: ObjectProperty
comment: Describes the form of the item. Powder; tablets; capsule.
domain: MedicationKnowledge
range: CodeableConcept
title: powder | tablets | capsule +

ExampleScenario.process.step.operation.initiatorActive
type: ObjectProperty
comment: Whether the initiator is deactivated right after the transaction.
domain: ExampleScenarioProcessComponent.ExampleScenarioProcessStepComponent.ExampleScenarioProcessStepOperationComponent
range: boolean
title: Whether the initiator is deactivated right after the transaction

Specimen.collection.fastingStatusDuration
type: ObjectProperty
domain: SpecimenCollectionComponent
range: Duration
sub property of: Specimen.collection.fastingStatus

PaymentReconciliation.identifier
type: ObjectProperty
comment: The Response business identifier.
domain: PaymentReconciliation
range: Identifier
sub property of: id
title: Business Identifier

Person.identifier
type: ObjectProperty
comment: Identifier for a person within a particular scope.
domain: Person
range: Identifier
sub property of: id
title: A human identifier for this person

CapabilityStatement.rest.searchParam.definition
type: ObjectProperty
comment: An absolute URI that is a formal reference to where this parameter was first defined, so that a client can be confident of the meaning of the search parameter (a reference to [SearchParameter.url]). This element SHALL be populated if the search parameter refers to a SearchParameter defined by the FHIR core specification or externally defined IGs.
domain: CapabilityStatementRestComponentSearchParam
range: canonical
title: Source of definition for parameter

VerificationResult
type: Class
comment: Describes validation requirements, source(s), status and dates for one or more elements.
subclass of: DomainResource
subclass of: administrative.entity
subclass of: Restriction
  all values from: date
  max cardinality: 1
  on property: VerificationResult.nextScheduled
subclass of: Restriction
  all values from: VerificationResultPrimarySourceComponent
  on property: VerificationResult.primarySource
subclass of: Restriction
  cardinality: 1
  on property: VerificationResult.status
  some values from: code
subclass of: Restriction
  all values from: dateTime
  max cardinality: 1
  on property: VerificationResult.statusDate
subclass of: Restriction
  all values from: VerificationResultAttestationComponent
  max cardinality: 1
  on property: VerificationResult.attestation
subclass of: Restriction
  all values from: dateTime
  max cardinality: 1
  on property: VerificationResult.lastPerformed
subclass of: Restriction
  all values from: Timing
  max cardinality: 1
  on property: VerificationResult.frequency
subclass of: Restriction
  all values from: CodeableConcept
  max cardinality: 1
  on property: VerificationResult.need
subclass of: Restriction
  all values from: CodeableConcept
  max cardinality: 1
  on property: VerificationResult.failureAction
subclass of: Restriction
  all values from: VerificationResultValidatorComponent
  on property: VerificationResult.validator
subclass of: Restriction
  all values from: CodeableConcept
  max cardinality: 1
  on property: VerificationResult.validationType
subclass of: Restriction
  all values from: CodeableConcept
  on property: VerificationResult.validationProcess
subclass of: Restriction
  all values from: string
  on property: VerificationResult.targetLocation
subclass of: Restriction
  all values from: Reference
  on property: VerificationResult.target

TerminologyCapabilities.software.name
type: ObjectProperty
comment: Name the software is known by.
domain: TerminologyCapabilitiesSoftwareComponent
range: string
title: A name the software is known by

Task.focus
type: ObjectProperty
comment: The request being actioned or the resource being manipulated by this task.
domain: Task
range: Reference
sub property of: what
title: What task is acting on

MedicinalProductIndication.undesirableEffect
type: ObjectProperty
comment: Describe the undesirable effects of the medicinal product.
domain: MedicinalProductIndication
range: Reference
title: Describe the undesirable effects of the medicinal product

Contract.term.securityLabel.category
type: ObjectProperty
comment: Security label privacy tag that species the applicable privacy and security policies governing this term and/or term elements.
domain: Contract.TermComponent.SecurityLabelComponent
range: Coding
title: Applicable Policy

PlanDefinition.action.selectionBehavior
type: ObjectProperty
comment: Defines the selection behavior for the action and its children.
domain: PlanDefinitionActionComponent
range: code
title: any | all | all-or-none | exactly-one | at-most-one | one-or-more

ExampleScenario.process.step.alternative
type: ObjectProperty
comment: Each interaction in the workflow.
domain: ExampleScenarioProcessComponent.ExampleScenarioProcessStepComponent
range: ExampleScenarioProcessComponent.ExampleScenarioProcessStepComponent.ExampleScenarioProcessStepAlternativeComponent
title: Each interaction in the process

QuestionnaireResponse.item.answer.item.linkId
type: ObjectProperty
comment: The item from the Questionnaire that corresponds to this item in the QuestionnaireResponse resource.
domain: QuestionnaireResponseItemComponent.QuestionnaireResponseItemAnswerComponentItem
range: string
title: Pointer to specific item from Questionnaire

Consent.provision.provision.type
type: ObjectProperty
comment: Action to take - permit or deny - when the rule conditions are met. Not permitted in root rule, required in all nested rules.
domain: Consent.provisionComponentProvision
range: code
title: deny | permit

MedicationKnowledgeRelatedMedicationKnowledgeComponent
type: Class
comment: Associated or related knowledge about a medication.
subclass of: BackboneElement
subclass of: Restriction
  on property: MedicationKnowledge.relatedMedicationKnowledge.reference
  some values from: Reference
subclass of: Restriction
  cardinality: 1
  on property: MedicationKnowledge.relatedMedicationKnowledge.type
  some values from: CodeableConcept

ResearchStudy.arm
type: ObjectProperty
comment: Describes an expected sequence of events for one of the participants of a study. E.g. Exposure to drug A, wash-out, exposure to drug B, wash-out, follow-up.
domain: ResearchStudy
range: ResearchStudyArmComponent
title: Defined path through the study for a subject

SupplyRequest.parameter.code
type: ObjectProperty
comment: A code or string that identifies the device detail being asserted.
domain: SupplyRequestParameterComponent
range: CodeableConcept
sub property of: what
title: Item detail

PlanDefinition.action.action.participant.type
type: ObjectProperty
comment: The type of participant in the action.
domain: PlanDefinitionActionComponentAction.PlanDefinitionActionParticipantComponent
range: code
title: patient | practitioner | related-person | device

PlanDefinition.relatedArtifact
type: ObjectProperty
comment: Related artifacts such as additional documentation, justification, or bibliographic references.
domain: PlanDefinition
range: RelatedArtifact
title: Additional documentation, citations

QuestionnaireResponse.item.answer.valueUri
type: ObjectProperty
domain: QuestionnaireResponseItemComponent.QuestionnaireResponseItemAnswerComponent
range: uri
sub property of: QuestionnaireResponse.item.answer.value

AuditEvent.entity.securityLabel
type: ObjectProperty
comment: Security labels for the identified entity.
domain: AuditEventEntityComponent
range: Coding
sub property of: context
title: Security labels on the entity

PlanDefinition.editor
type: ObjectProperty
comment: An individual or organization primarily responsible for internal coherence of the content.
domain: PlanDefinition
range: ContactDetail
title: Who edited the content

ServiceRequest.quantityRange
type: ObjectProperty
domain: ServiceRequest
range: Range
sub property of: ServiceRequest.quantity

SubstanceSpecification.structure.structuralRepresentation
type: ObjectProperty
comment: Molectular structural representation.
domain: SubstanceSpecificationStructureComponent
range: SubstanceSpecificationStructureComponent.SubstanceSpecificationStructureStructuralRepresentationComponent
title: Molectular structural representation

ClaimResponse.insurance.coverage
type: ObjectProperty
comment: Reference to the program or plan identification, underwriter or payor.
domain: ClaimResponse.InsuranceComponent
range: Reference
title: Insurance information

RequestGroup.action.relatedAction.offsetDuration
type: ObjectProperty
domain: RequestGroupActionComponent.RequestGroupActionRelatedActionComponent
range: Duration
sub property of: RequestGroup.action.relatedAction.offset

ClaimResponse.addItem.detail.subDetail.quantity
type: ObjectProperty
comment: The number of repetitions of a service or product.
domain: ClaimResponse.AddedItemComponent.AddedItemDetailComponent.AddedItemSubDetailComponent
range: SimpleQuantity
title: Count of Products or Services

Nested process
type: Class
comment: Nested process.
label: ExampleScenarioProcessComponent.ExampleScenarioProcessStepComponentProcess.ExampleScenarioProcessStepComponent.ExampleScenarioProcessStepAlternativeComponent.ExampleScenarioProcessStepAlternativeOptionComponentStepProcess
subclass of: BackboneElement

MedicationDispense.category
type: ObjectProperty
comment: Indicates the type of medication dispense (for example, where the medication is expected to be consumed or administered (i.e. inpatient or outpatient)).
domain: MedicationDispense
range: CodeableConcept
title: Type of medication dispense

MedicinalProductUndesirableEffectPopulationComponent
type: Class
comment: The population group to which this applies.
subclass of: BackboneElement
subclass of: Restriction
  all values from: CodeableConcept
  max cardinality: 1
  on property: MedicinalProductUndesirableEffect.population.physiologicalCondition
subclass of: Restriction
  all values from: CodeableConcept
  max cardinality: 1
  on property: MedicinalProductUndesirableEffect.population.race
subclass of: Restriction
  all values from: CodeableConcept
  max cardinality: 1
  on property: MedicinalProductUndesirableEffect.population.gender
subclass of:
  union of: Restriction
    all values from: Range
    max cardinality: 1
    on property: MedicinalProductUndesirableEffect.population.ageRange
  union of: Restriction
    all values from: CodeableConcept
    max cardinality: 1
    on property: MedicinalProductUndesirableEffect.population.ageCodeableConcept

MedicinalProductContraindication.otherTherapy.medicationReference
type: ObjectProperty
domain: MedicinalProductContraindicationOtherTherapyComponent
range: Reference
sub property of: MedicinalProductContraindication.otherTherapy.medication

ServiceRequest.priority
type: ObjectProperty
comment: Indicates how quickly the ServiceRequest should be addressed with respect to other requests.
domain: ServiceRequest
range: code
sub property of: grade
title: routine | urgent | asap | stat

Invoice.lineItem.priceComponent.factor
type: ObjectProperty
comment: The factor that has been applied on the base price for calculating this component.
domain: InvoiceLineItemComponent.InvoiceLineItemPriceComponentComponent
range: decimal
title: Factor used for calculating this component

InsurancePlanPlanComponent.InsurancePlanPlanGeneralCostComponent
type: Class
comment: Overall costs associated with the plan.
subclass of: BackboneElement
subclass of: Restriction
  all values from: string
  max cardinality: 1
  on property: InsurancePlan.plan.generalCost.comment
subclass of: Restriction
  all values from: Money
  max cardinality: 1
  on property: InsurancePlan.plan.generalCost.cost
subclass of: Restriction
  all values from: positiveInt
  max cardinality: 1
  on property: InsurancePlan.plan.generalCost.groupSize
subclass of: Restriction
  all values from: CodeableConcept
  max cardinality: 1
  on property: InsurancePlan.plan.generalCost.type

Narrative
type: Class
comment: A human-readable formatted text, including images.
subclass of: Element
subclass of: Restriction
  cardinality: 1
  on property: Narrative.div
  some values from: http://hl7.org/fhir/xhtml
subclass of: Restriction
  cardinality: 1
  on property: Narrative.status
  some values from: code
title: A human-readable formatted text, including images

EventDefinition.purpose
type: ObjectProperty
comment: Explanation of why this event definition is needed and why it has been designed as it has.
domain: EventDefinition
range: markdown
sub property of: why
title: Why this event definition is defined

MedicinalProductAuthorization.procedure.application.identifier
type: ObjectProperty
comment: Identifier for this procedure.
domain: MedicinalProductAuthorizationProcedureComponentProcedure
range: Identifier
title: Identifier for this procedure

CareTeam.managingOrganization
type: ObjectProperty
comment: The organization responsible for the care team.
domain: CareTeam
range: Reference
title: Organization responsible for the care team

StructureMap.group.rule.rule.source.max
type: ObjectProperty
comment: Specified maximum cardinality for the element - a number or a "*". This is optional; if present, it acts an implicit check on the input content (* just serves as documentation; it's the default value).
domain: StructureMapGroupComponent.StructureMapGroupRuleComponentRule.StructureMapGroupRuleSourceComponent
range: string
title: Specified maximum cardinality (number or *)

Account.status
type: ObjectProperty
comment: Indicates whether the account is presently used/usable or not.
domain: Account
range: code
sub property of: status
title: active | inactive | entered-in-error | on-hold | unknown

MedicinalProduct.manufacturingBusinessOperation.regulator
type: ObjectProperty
comment: A regulator which oversees the operation.
domain: MedicinalProductManufacturingBusinessOperationComponent
range: Reference
title: A regulator which oversees the operation

Invoice.totalGross
type: ObjectProperty
comment: Invoice total, tax included.
domain: Invoice
range: Money
title: Gross total of this Invoice

ResearchStudy.title
type: ObjectProperty
comment: A short, descriptive user-friendly label for the study.
domain: ResearchStudy
range: string
title: Name for this study

ExampleScenario.actor.actorId
type: ObjectProperty
comment: ID or acronym of actor.
domain: ExampleScenarioActorComponent
range: string
title: ID or acronym of the actor

Address.city
type: ObjectProperty
comment: The name of the city, town, suburb, village or other community or delivery center.
domain: Address
range: string
title: Name of city, town etc.

MedicinalProductPackaged.batchIdentifier
type: ObjectProperty
comment: Batch numbering.
domain: MedicinalProductPackaged
range: MedicinalProductPackagedBatchIdentifierComponent
title: Batch numbering

Contract.term.action.doNotPerform
type: ObjectProperty
comment: True if the term prohibits the action.
domain: Contract.TermComponent.ActionComponent
range: boolean
title: True if the term prohibits the action

StructureMap.group.rule.rule.target.parameter.valueBoolean
type: ObjectProperty
domain: StructureMapGroupComponent.StructureMapGroupRuleComponentRule.StructureMapGroupRuleTargetComponent.StructureMapGroupRuleTargetParameterComponent
range: boolean
sub property of: StructureMap.group.rule.rule.target.parameter.value

Contract.term.group.asset.answer.valueDate
type: ObjectProperty
domain: Contract.TermComponentTerm.ContractAssetComponentAnswer
range: date
sub property of: Contract.term.group.asset.answer.value

MedicinalProductPharmaceutical.device
type: ObjectProperty
comment: Accompanying device.
domain: MedicinalProductPharmaceutical
range: Reference
title: Accompanying device

GraphDefinitionLinkComponent.GraphDefinitionLinkTargetComponentLink
type: Class
comment: Additional links from target resource.
subclass of: BackboneElement
subclass of: Restriction
  all values from: string
  max cardinality: 1
  on property: GraphDefinition.link.target.link.sliceName
subclass of: Restriction
  all values from: GraphDefinitionLinkComponent.GraphDefinitionLinkTargetComponentLink.GraphDefinitionLinkTargetComponent
  on property: GraphDefinition.link.target.link.target
subclass of: Restriction
  all values from: string
  max cardinality: 1
  on property: GraphDefinition.link.target.link.max
subclass of: Restriction
  all values from: integer
  max cardinality: 1
  on property: GraphDefinition.link.target.link.min
subclass of: Restriction
  all values from: string
  max cardinality: 1
  on property: GraphDefinition.link.target.link.description
subclass of: Restriction
  all values from: string
  max cardinality: 1
  on property: GraphDefinition.link.target.link.path
title: Additional links from target resource

Library.parameter
type: ObjectProperty
comment: The parameter element defines parameters used by the library.
domain: Library
range: ParameterDefinition
title: Parameters defined by the library

RiskAssessment.prediction.outcome
type: ObjectProperty
comment: One of the potential outcomes for the patient (e.g. remission, death, a particular condition).
domain: RiskAssessmentPredictionComponent
range: CodeableConcept
title: Possible outcome for the subject

ClaimResponse.payment.adjustment
type: ObjectProperty
comment: Adjustment to the payment of this transaction which is not related to adjudication of this transaction.
domain: ClaimResponse.PaymentComponent
range: Money
title: Payment adjustment for non-Claim issues

ExplanationOfBenefit.benefitBalance.financial.allowedMoney
type: ObjectProperty
domain: ExplanationOfBenefit.BenefitBalanceComponent.BenefitComponent
range: Money
sub property of: ExplanationOfBenefit.benefitBalance.financial.allowed

CarePlan.activity.detail.status
type: ObjectProperty
comment: Identifies what progress is being made for the specific activity.
domain: CarePlanActivityComponent.CarePlanActivityDetailComponent
range: code
title: not-started | scheduled | in-progress | on-hold | completed | cancelled | stopped | unknown | entered-in-error

CapabilityStatement.rest.security.description
type: ObjectProperty
comment: General description of how security works.
domain: CapabilityStatementRestComponent.CapabilityStatementRestSecurityComponent
range: markdown
title: General description of how security works

Group.characteristic.period
type: ObjectProperty
comment: The period over which the characteristic is tested; e.g. the patient had an operation during the month of June.
domain: GroupCharacteristicComponent
range: Period
title: Period over which characteristic is tested

SupplyRequest.parameter.valueCodeableConcept
type: ObjectProperty
domain: SupplyRequestParameterComponent
range: CodeableConcept
sub property of: SupplyRequest.parameter.value

ValueSet.identifier
type: ObjectProperty
comment: A formal identifier that is used to identify this value set when it is represented in other formats, or referenced in a specification, model, design or an instance.
domain: ValueSet
range: Identifier
sub property of: id
title: Additional identifier for the value set (business identifier)

Contract.legallyBindingReference
type: ObjectProperty
domain: Contract
range: Reference
sub property of: Contract.legallyBinding

MedicationRequest.context
type: ObjectProperty
comment: A link to an encounter, or episode of care, that identifies the particular occurrence or set occurrences of contact between patient and health care provider.
domain: MedicationRequest
range: Reference
sub property of: context
title: Created during encounter/admission/stay

Contract.term.group.offer.answer
type: ObjectProperty
comment: Response to offer text.
domain: Contract.TermComponentTerm.ContractOfferComponent
range: Contract.TermComponentTerm.ContractOfferComponent.AnswerComponent
title: Response to offer text

EnrollmentRequest.coverage
type: ObjectProperty
comment: Reference to the program or plan identification, underwriter or payor.
domain: EnrollmentRequest
range: Reference
title: Insurance information

Quantity.system
type: ObjectProperty
comment: The identification of the system that provides the coded form of the unit.
domain: Quantity
range: uri
title: System that defines coded unit form

VerificationResult.nextScheduled
type: ObjectProperty
comment: The date when target is next validated, if appropriate.
domain: VerificationResult
range: date
title: The date when target is next validated, if appropriate

ValueSet.compose.include.filter.op
type: ObjectProperty
comment: The kind of operation to perform as a part of the filter criteria.
domain: ValueSetComposeComponent.ConceptSetComponent.ConceptSetFilterComponent
range: code
title: = | is-a | descendent-of | is-not-a | regex | in | not-in | generalizes | exists

SupplyDelivery.partOf
type: ObjectProperty
comment: A larger event of which this particular event is a component or step.
domain: SupplyDelivery
range: Reference
title: Part of referenced event

EntryDefinition.type
type: ObjectProperty
comment: The type of item - medication, device, service, protocol or other.
domain: EntryDefinition
range: CodeableConcept
title: The type of item - medication, device, service, protocol or other

ImplementationGuide.definition.template.scope
type: ObjectProperty
comment: The scope in which the template applies.
domain: ImplementationGuideDefinitionComponent.ImplementationGuideDefinitionTemplateComponent
range: string
title: The scope in which the template applies

Consent.patient
type: ObjectProperty
comment: The patient/healthcare consumer to whom this consent applies.
domain: Consent
range: Reference
sub property of: who.focus
title: Who the consent applies to

EventDefinition.url
type: ObjectProperty
comment: An absolute URI that is used to identify this event definition when it is referenced in a specification, model, design or an instance; also called its canonical identifier. This SHOULD be globally unique and SHOULD be a literal address at which at which an authoritative instance of this event definition is (or will be) published. This URL can be the target of a canonical reference. It SHALL remain the same when the event definition is stored on different servers.
domain: EventDefinition
range: uri
sub property of: id
title: Canonical identifier for this event definition, represented as a URI (globally unique)

TestScript.setup.action.operation.requestId
type: ObjectProperty
comment: The fixture id (maybe new) to map to the request.
domain: TestScriptSetupComponent.SetupActionComponent.SetupActionOperationComponent
range: id
title: Fixture Id of mapped request

ExampleScenario.process.step.alternative.option.step.alternative.option
type: ObjectProperty
comment: Each of the possible options in an alternative.
domain: ExampleScenarioProcessComponent.ExampleScenarioProcessStepComponent.ExampleScenarioProcessStepAlternativeComponent.ExampleScenarioProcessStepAlternativeOptionComponentStep.ExampleScenarioProcessStepAlternativeComponent
range: ExampleScenarioProcessComponent.ExampleScenarioProcessStepComponent.ExampleScenarioProcessStepAlternativeComponent.ExampleScenarioProcessStepAlternativeOptionComponentStep.ExampleScenarioProcessStepAlternativeComponent.ExampleScenarioProcessStepAlternativeOptionComponent
title: Each of the possible options in an alternative

CapabilityStatement.software.name
type: ObjectProperty
comment: Name the software is known by.
domain: CapabilityStatementSoftwareComponent
range: string
title: A name the software is known by

CodeSystem.contact
type: ObjectProperty
comment: Contact details to assist a user in finding and communicating with the publisher.
domain: CodeSystem
range: ContactDetail
title: Contact details for the publisher

BundleEntryComponent.BundleEntryRequestComponent
type: Class
comment: Additional information about how this entry should be processed as part of a transaction or batch. For history, it shows how the entry was processed to create the version contained in the entry.
subclass of: BackboneElement
subclass of: Restriction
  all values from: string
  max cardinality: 1
  on property: Bundle.entry.request.ifNoneExist
subclass of: Restriction
  all values from: string
  max cardinality: 1
  on property: Bundle.entry.request.ifMatch
subclass of: Restriction
  cardinality: 1
  on property: Bundle.entry.request.method
  some values from: code
subclass of: Restriction
  cardinality: 1
  on property: Bundle.entry.request.url
  some values from: uri
subclass of: Restriction
  all values from: instant
  max cardinality: 1
  on property: Bundle.entry.request.ifModifiedSince
subclass of: Restriction
  all values from: string
  max cardinality: 1
  on property: Bundle.entry.request.ifNoneMatch

ElementDefinition.constraint.requirements
type: ObjectProperty
comment: Description of why this constraint is necessary or appropriate.
domain: ElementDefinitionConstraintComponent
range: string
title: Why this constraint is necessary or appropriate

Questionnaire.contact
type: ObjectProperty
comment: Contact details to assist a user in finding and communicating with the publisher.
domain: Questionnaire
range: ContactDetail
title: Contact details for the publisher

ValueSet.expansion.contains.contains.version
type: ObjectProperty
comment: The version of the code system from this code was taken. Note that a well-maintained code system does not need the version reported, because the meaning of codes is consistent across versions. However this cannot consistently be assured, and when the meaning is not guaranteed to be consistent, the version SHOULD be exchanged.
domain: ValueSetExpansionComponent.ValueSetExpansionContainsComponentContains
range: string
title: Version in which this code/display is defined

ExplanationOfBenefit.addItem.detail.subDetail.billcode
type: ObjectProperty
comment: If this is an actual service or product line, i.e. not a Group, then use code to indicate the Professional Service or Product supplied (e.g. CTP, HCPCS,USCLS,ICD10, NCPDP,DIN,ACHI,CCI). If a grouping item then use a group code to indicate the type of thing being grouped eg. 'glasses' or 'compound'.
domain: ExplanationOfBenefit.AddedItemComponent.AddedItemDetailComponent.AddedItemDetailSubDetailComponent
range: CodeableConcept
title: Billing Code

Contract.term.group.asset.valuedItem.recipient
type: ObjectProperty
comment: Who will receive payment.
domain: Contract.TermComponentTerm.ContractAssetComponent.ValuedItemComponent
range: Reference
title: Who will receive payment

CapabilityStatement.rest.operation.name
type: ObjectProperty
comment: The name of the operation or query. For an operation, this is the name prefixed with $ and used in the URL. For a query, this is the name used in the _query parameter when the query is called.
domain: CapabilityStatementRestComponentOperation
range: string
title: Name by which the operation/query is invoked

CodeSystem.title
type: ObjectProperty
comment: A short, descriptive, user-friendly title for the code system.
domain: CodeSystem
range: string
title: Name for this code system (human friendly)

Slot.schedule
type: ObjectProperty
comment: The schedule resource that this slot defines an interval of status information.
domain: Slot
range: Reference
title: The schedule resource that this slot defines an interval of status information

QuestionnaireResponse.item.answer.item.definition
type: ObjectProperty
comment: A reference to an [ElementDefinition] that provides the details for the item.
domain: QuestionnaireResponseItemComponent.QuestionnaireResponseItemAnswerComponentItem
range: uri
title: ElementDefinition - details for the item

BackboneElement.modifierExtension
type: ObjectProperty
comment: May be used to represent additional information that is not part of the basic definition of the element and that modifies the understanding of the element in which it is contained. Usually modifier elements provide negation or qualification. To make the use of extensions safe and manageable, there is a strict set of governance applied to the definition and use of extensions. Though any implementer can define an extension, there is a set of requirements that SHALL be met as part of the definition of the extension. Applications processing a resource are required to check for modifier extensions. Modifier extensions SHALL NOT change the meaning of any elements on Resource or DomainResource (including cannot change the meaning of modifierExtension itself).
domain: BackboneElement
range: Extension
title: Extensions that cannot be ignored if unrecognized

TestScript.test.action.assert.validateProfileId
type: ObjectProperty
comment: The ID of the Profile to validate against.
domain: TestScriptTestComponent.TestActionComponentAssert
range: id
title: Profile Id of validation profile reference

ClaimResponse.payment.amount
type: ObjectProperty
comment: Payable less any payment adjustment.
domain: ClaimResponse.PaymentComponent
range: Money
title: Payable amount after adjustment

ServiceRequest.reasonCode
type: ObjectProperty
comment: An explanation or justification for why this service is being requested in coded or textual form. This is often for billing purposes. May relate to the resources referred to in supportingInformation.
domain: ServiceRequest
range: CodeableConcept
sub property of: why
title: Explanation/Justification for procedure or service

TerminologyCapabilities.codeSystem.version.property
type: ObjectProperty
comment: Properties supported for $lookup.
domain: TerminologyCapabilitiesCodeSystemComponent.TerminologyCapabilitiesCodeSystemVersionComponent
range: code
title: Properties supported for $lookup

PlanDefinition.action.action.relatedAction.offset
type: ObjectProperty

SubstanceSpecificationSubstanceNameComponent
type: Class
comment: Names applicable to this substence.
subclass of: BackboneElement
subclass of: Restriction
  all values from: string
  max cardinality: 1
  on property: SubstanceSpecification.substanceName.name
subclass of: Restriction
  all values from: CodeableConcept
  on property: SubstanceSpecification.substanceName.jurisdiction
subclass of: Restriction
  all values from: CodeableConcept
  on property: SubstanceSpecification.substanceName.domain
subclass of: Restriction
  all values from: CodeableConcept
  on property: SubstanceSpecification.substanceName.language
subclass of: Restriction
  all values from: CodeableConcept
  max cardinality: 1
  on property: SubstanceSpecification.substanceName.type
subclass of: Restriction
  all values from: string
  on property: SubstanceSpecification.substanceName.referenceSource
subclass of: Restriction
  all values from: SubstanceSpecificationSubstanceNameComponent.SubstanceSpecificationSubstanceNameOfficialNameComponent
  on property: SubstanceSpecification.substanceName.officialName

GraphDefinition.experimental
type: ObjectProperty
comment: A Boolean value to indicate that this graph definition is authored for testing purposes (or education/evaluation/marketing) and is not intended to be used for genuine usage.
domain: GraphDefinition
range: boolean
sub property of: class
title: For testing purposes, not real usage

StructureMap.structure.url
type: ObjectProperty
comment: The canonical URL that identifies the structure.
domain: StructureMapStructureComponent
range: canonical
title: Canonical URL for structure definition

MedicationDispense.performer
type: ObjectProperty
comment: Indicates who or what performed the event.
domain: MedicationDispense
range: MedicationDispensePerformerComponent
title: Who performed event

TestScript.metadata
type: ObjectProperty
comment: The required capability must exist and are assumed to function correctly on the FHIR server being tested.
domain: TestScript
range: TestScriptMetadataComponent
title: Required capability that is assumed to function correctly on the FHIR server being tested

Address.type
type: ObjectProperty
comment: Distinguishes between physical addresses (those you can visit) and mailing addresses (e.g. PO Boxes and care-of addresses). Most addresses are both.
domain: Address
range: code
title: postal | physical | both

MedicinalProductAuthorizationProcedureComponentProcedure
type: Class
comment: Applcations submitted to obtain a marketing authorization.
subclass of: BackboneElement
subclass of: Restriction
  all values from: MedicinalProductAuthorizationProcedureComponentProcedureProcedure
  on property: MedicinalProductAuthorization.procedure.application.application
subclass of:
  union of: Restriction
    all values from: Period
    max cardinality: 1
    on property: MedicinalProductAuthorization.procedure.application.datePeriod
  union of: Restriction
    all values from: dateTime
    max cardinality: 1
    on property: MedicinalProductAuthorization.procedure.application.dateDateTime
subclass of: Restriction
  cardinality: 1
  on property: MedicinalProductAuthorization.procedure.application.type
  some values from: CodeableConcept
subclass of: Restriction
  all values from: Identifier
  max cardinality: 1
  on property: MedicinalProductAuthorization.procedure.application.identifier
title: Applcations submitted to obtain a marketing authorization

Questionnaire.code
type: ObjectProperty
comment: An identifier for this question or group of questions in a particular terminology such as LOINC.
domain: Questionnaire
range: Coding
title: Concept that represents the overall questionnaire

Observation.component.referenceRange.appliesTo
type: ObjectProperty
comment: Codes to indicate the target population this reference range applies to. For example, a reference range may be based on the normal population or a particular sex or race.
domain: ObservationComponentComponentReferenceRange
range: CodeableConcept
title: Reference range population

Questionnaire.item.item.initial.valueUri
type: ObjectProperty
domain: QuestionnaireItemComponentItem.QuestionnaireItemInitialComponent
range: uri
sub property of: Questionnaire.item.item.initial.value

MedicinalProductContraindication.population.gender
type: ObjectProperty
comment: The gender of the specific population.
domain: MedicinalProductContraindicationPopulationComponent
range: CodeableConcept
title: The gender of the specific population

DataRequirement.sort.direction
type: ObjectProperty
comment: The direction of the sort, ascending or descending.
domain: DataRequirementSortComponent
range: code
title: ascending | descending

MedicinalProduct.productClassification
type: ObjectProperty
comment: Allows the product to be classified by various systems.
domain: MedicinalProduct
range: CodeableConcept
title: Allows the product to be classified by various systems

Provenance.occurredPeriod
type: ObjectProperty
domain: Provenance
range: Period
sub property of: Provenance.occurred

MedicinalProduct.undesirableEffect
type: ObjectProperty
comment: Potential clinical unwanted effects of use.
domain: MedicinalProduct
range: Reference
title: Potential clinical unwanted effects of use

TestScript.setup.action.assert.compareToSourcePath
type: ObjectProperty
comment: XPath or JSONPath expression to evaluate against the source fixture. When compareToSourceId is defined, either compareToSourceExpression or compareToSourcePath must be defined, but not both.
domain: TestScriptSetupComponent.SetupActionComponent.SetupActionAssertComponent
range: string
title: XPath or JSONPath expression to evaluate against the source fixture

MedicinalProductPharmaceuticalRouteOfAdministrationComponent.MedicinalProductPharmaceuticalRouteOfAdministrationTargetSpeciesComponent.MedicinalProductPharmaceuticalRouteOfAdministrationTargetSpeciesWithdrawalPeriodComponent
type: Class
comment: A species specific time during which consumption of animal product is not appropriate.
subclass of: BackboneElement
subclass of: Restriction
  all values from: string
  max cardinality: 1
  on property: MedicinalProductPharmaceutical.routeOfAdministration.targetSpecies.withdrawalPeriod.supportingInformation
subclass of: Restriction
  cardinality: 1
  on property: MedicinalProductPharmaceutical.routeOfAdministration.targetSpecies.withdrawalPeriod.value
  some values from: Quantity
subclass of: Restriction
  cardinality: 1
  on property: MedicinalProductPharmaceutical.routeOfAdministration.targetSpecies.withdrawalPeriod.tissue
  some values from: CodeableConcept

ClaimResponse.addItem.detail.subDetail.adjudication
type: ObjectProperty
comment: The adjudication results.
domain: ClaimResponse.AddedItemComponent.AddedItemDetailComponent.AddedItemSubDetailComponent
range: ClaimResponse.AddedItemComponent.AddedItemDetailComponent.AddedItemSubDetailComponentAdjudication
title: Added items detail adjudication

Contract.term.offer.party.reference
type: ObjectProperty
comment: Participant in the offer.
domain: Contract.TermComponent.ContractOfferComponent.ContractPartyComponent
range: Reference
title: Referenced entity

ExplanationOfBenefit.item.adjudication.amount
type: ObjectProperty
comment: Monitory amount associated with the code.
domain: ExplanationOfBenefit.ItemComponent.AdjudicationComponent
range: Money
title: Monetary amount

CodeSystem.concept.concept.property.valueInteger
type: ObjectProperty
domain: CodeSystem.ConceptDefinitionComponentConcept.ConceptPropertyComponent
range: integer
sub property of: CodeSystem.concept.concept.property.value

Practitioner.qualification
type: ObjectProperty
comment: The official certifications, training, and licenses that authorize or otherwise pertain to the provision of care by the practitioner. For example, a medical license issued by a medical board authorizing the practitioner to practice medicine within a certian locality.
domain: Practitioner
range: PractitionerQualificationComponent
title: Certification, licenses, or training pertaining to the provision of care

PlanDefinition.reviewer
type: ObjectProperty
comment: An individual or organization primarily responsible for review of some aspect of the content.
domain: PlanDefinition
range: ContactDetail
title: Who reviewed the content

MedicationRequest.note
type: ObjectProperty
comment: Extra information about the prescription that could not be conveyed by the other attributes.
domain: MedicationRequest
range: Annotation
title: Information about the prescription

InsurancePlan.alias
type: ObjectProperty
comment: A list of alternate names that the product is known as, or was known as in the past.
domain: InsurancePlan
range: string
title: Alternate names

TestScriptSetupComponent.SetupActionComponent.SetupActionAssertComponent.ActionAssertRulesetComponent.ActionAssertRulesetRuleComponent
type: Class
comment: The referenced rule within the external ruleset template.
subclass of: BackboneElement
subclass of: Restriction
  all values from: TestScriptSetupComponent.SetupActionComponent.SetupActionAssertComponent.ActionAssertRulesetComponent.ActionAssertRulesetRuleComponent.ActionAssertRulesetRuleParamComponent
  on property: TestScript.setup.action.assert.ruleset.rule.param
subclass of: Restriction
  cardinality: 1
  on property: TestScript.setup.action.assert.ruleset.rule.ruleId
  some values from: id

TerminologyCapabilitiesCodeSystemComponent.TerminologyCapabilitiesCodeSystemVersionComponent
type: Class
comment: For the code system, a list of versions that are supported by the server.
subclass of: BackboneElement
subclass of: Restriction
  all values from: code
  on property: TerminologyCapabilities.codeSystem.version.property
subclass of: Restriction
  all values from: boolean
  max cardinality: 1
  on property: TerminologyCapabilities.codeSystem.version.compositional
subclass of: Restriction
  all values from: code
  on property: TerminologyCapabilities.codeSystem.version.language
subclass of: Restriction
  all values from: boolean
  max cardinality: 1
  on property: TerminologyCapabilities.codeSystem.version.isDefault
subclass of: Restriction
  all values from: string
  max cardinality: 1
  on property: TerminologyCapabilities.codeSystem.version.code
subclass of: Restriction
  all values from: TerminologyCapabilitiesCodeSystemComponent.TerminologyCapabilitiesCodeSystemVersionComponent.TerminologyCapabilitiesCodeSystemVersionFilterComponent
  on property: TerminologyCapabilities.codeSystem.version.filter

Coding.system
type: ObjectProperty
comment: The identification of the code system that defines the meaning of the symbol in the code.
domain: Coding
range: uri
title: Identity of the terminology system

Task.reasonCode
type: ObjectProperty
comment: A description or code indicating why this task needs to be performed.
domain: Task
range: CodeableConcept
sub property of: why
title: Why task is needed

ClaimResponse.addItem.detailSequence
type: ObjectProperty
comment: The sequence number of the addition within the line item submitted which contains the error. This value is omitted when the error is not related to an Addition.
domain: ClaimResponse.AddedItemComponent
range: positiveInt
title: Detail sequence number

RequestGroup.action.action.code
type: ObjectProperty
comment: A code that provides meaning for the action or action group. For example, a section may have a LOINC code for a the section of a documentation template.
domain: RequestGroupActionComponentAction
range: CodeableConcept
title: Code representing the meaning of the action or sub-actions

SubstanceSpecification.molecularWeight.amount
type: ObjectProperty
comment: Used to capture quantitative values for a variety of elements. If only limits are given, the arithmetic mean would be the average. If only a single definite value for a given element is given, it would be captured in this field.
domain: SubstanceSpecificationMolecularWeight
range: string
title: Used to capture quantitative values for a variety of elements. If only limits are given, the arithmetic mean would be the average. If only a single definite value for a given element is given, it would be captured in this field

TestScript.setup.action.operation.params
type: ObjectProperty
comment: Path plus parameters after [type]. Used to set parts of the request URL explicitly.
domain: TestScriptSetupComponent.SetupActionComponent.SetupActionOperationComponent
range: string
title: Explicitly defined path parameters

ElementDefinition.base.min
type: ObjectProperty
comment: Minimum cardinality of the base element identified by the path.
domain: ElementDefinitionBaseComponent
range: unsignedInt
title: Min cardinality of the base element

Practitioner.qualification.code
type: ObjectProperty
comment: Coded representation of the qualification.
domain: PractitionerQualificationComponent
range: CodeableConcept
title: Coded representation of the qualification

SearchParameter.component.definition
type: ObjectProperty
comment: The definition of the search parameter that describes this part.
domain: SearchParameterComponentComponent
range: canonical
title: Defines how the part works

ExampleScenario.process.step.alternative.option.step.operation.receiverActive
type: ObjectProperty
comment: Whether the receiver is deactivated right after the transaction.
domain: ExampleScenarioProcessComponent.ExampleScenarioProcessStepComponent.ExampleScenarioProcessStepAlternativeComponent.ExampleScenarioProcessStepAlternativeOptionComponentStep.ExampleScenarioProcessStepOperationComponent
range: boolean
title: Whether the receiver is deactivated right after the transaction

CoverageEligibilityResponse.insurance.item.network
type: ObjectProperty
comment: Network designation.
domain: CoverageEligibilityResponse.InsuranceComponent.ItemsComponent
range: CodeableConcept
title: In or out of network

MedicinalProduct.clinicalTrial
type: ObjectProperty
comment: Clinical trials or studies that this product is involved in.
domain: MedicinalProduct
range: Reference
title: Clinical trials or studies that this product is involved in

Patient.multipleBirthBoolean
type: ObjectProperty
domain: Patient
range: boolean
sub property of: Patient.multipleBirth

Contract.term.asset.answer.valueQuantity
type: ObjectProperty
domain: Contract.TermComponent.ContractAssetComponentAnswer
range: Quantity
sub property of: Contract.term.asset.answer.value

Timing.repeat.boundsPeriod
type: ObjectProperty
domain: TimingRepeatComponent
range: Period
sub property of: Timing.repeat.bounds

Procedure.followUp
type: ObjectProperty
comment: If the procedure required specific follow up - e.g. removal of sutures. The followup may be represented as a simple note, or could potentially be more complex in which case the CarePlan resource can be used.
domain: Procedure
range: CodeableConcept
title: Instructions for follow up

ChargeItem.performingOrganization
type: ObjectProperty
comment: The organization requesting the service.
domain: ChargeItem
range: Reference
title: Organization providing the charged sevice

DocumentManifest.subject
type: ObjectProperty
comment: Who or what the set of documents is about. The documents can be about a person, (patient or healthcare practitioner), a device (i.e. machine) or even a group of subjects (such as a document about a herd of farm animals, or a set of patients that share a common exposure). If the documents cross more than one subject, then more than one subject is allowed here (unusual use case).
domain: DocumentManifest
range: Reference
sub property of: who.focus
title: The subject of the set of documents

Medication.ingredient.itemCodeableConcept
type: ObjectProperty
domain: MedicationIngredientComponent
range: CodeableConcept
sub property of: Medication.ingredient.item

PlanDefinition.goal.category
type: ObjectProperty
comment: Indicates a category the goal falls within.
domain: PlanDefinitionGoalComponent
range: CodeableConcept
title: E.g. Treatment, dietary, behavioral

Questionnaire.effectivePeriod
type: ObjectProperty
comment: The period during which the questionnaire content was or is planned to be in active use.
domain: Questionnaire
range: Period
title: When the questionnaire is expected to be used

Contract.term.applies
type: ObjectProperty
comment: Relevant time or time-period when this Contract Provision is applicable.
domain: Contract.TermComponent
range: Period
sub property of: when.done
title: Contract Term Effective Time

ClaimResponse.addItem
type: ObjectProperty
comment: The first-tier service adjudications for payor added services.
domain: ClaimResponse
range: ClaimResponse.AddedItemComponent
title: Insurer added line items

TestReport.test.name
type: ObjectProperty
comment: The name of this test used for tracking/logging purposes by test engines.
domain: TestReportTestComponent
range: string
title: Tracking/logging name of this test

ExampleScenarioProcessComponent.ExampleScenarioProcessStepComponent.ExampleScenarioProcessStepAlternativeComponent.ExampleScenarioProcessStepAlternativeOptionComponentStepProcess
type: Class
comment: Nested process.
subclass of: BackboneElement
subclass of: Restriction
  cardinality: 1
  on property: ExampleScenario.process.step.alternative.option.step.process.title
  some values from: string
subclass of: Restriction
  all values from: markdown
  max cardinality: 1
  on property: ExampleScenario.process.step.alternative.option.step.process.description
subclass of: Restriction
  all values from: markdown
  max cardinality: 1
  on property: ExampleScenario.process.step.alternative.option.step.process.preConditions
subclass of: Restriction
  all values from: ExampleScenarioProcessComponent.ExampleScenarioProcessStepComponent.ExampleScenarioProcessStepAlternativeComponent.ExampleScenarioProcessStepAlternativeOptionComponentStepProcess.ExampleScenarioProcessStepComponent
  on property: ExampleScenario.process.step.alternative.option.step.process.step
subclass of: Restriction
  all values from: markdown
  max cardinality: 1
  on property: ExampleScenario.process.step.alternative.option.step.process.postConditions
title: Nested process

ElementDefinition.slicing.ordered
type: ObjectProperty
comment: If the matching elements have to occur in the same order as defined in the profile.
domain: ElementDefinitionSlicingComponent
range: boolean
title: If elements must be in same order as slices

ExampleScenario.process.step.process.step.operation.request.versionId
type: ObjectProperty
comment: A specific version of a resource contained in the instance.
domain: ExampleScenarioProcessComponent.ExampleScenarioProcessStepComponentProcess.ExampleScenarioProcessStepComponent.ExampleScenarioProcessStepOperationComponentContainedInstance
range: string
title: A specific version of a resource contained in the instance

Sequence.quality.truthTP
type: ObjectProperty
comment: True positives, from the perspective of the truth data, i.e. the number of sites in the Truth Call Set for which there are paths through the Query Call Set that are consistent with all of the alleles at this site, and for which there is an accurate genotype call for the event.
domain: SequenceQualityComponent
range: decimal
title: True positives from the perspective of the truth data

Specimen.collection.fastingStatusCodeableConcept
type: ObjectProperty
domain: SpecimenCollectionComponent
range: CodeableConcept
sub property of: Specimen.collection.fastingStatus

Bundle.type
type: ObjectProperty
comment: Indicates the purpose of this bundle - how it is intended to be used.
domain: Bundle
range: code
sub property of: class
title: document | message | transaction | transaction-response | batch | batch-response | history | searchset | collection

Contract.FriendlyLanguageComponent
type: Class
comment: The "patient friendly language" versionof the Contract in whole or in parts. "Patient friendly language" means the representation of the Contract and Contract Provisions in a manner that is readily accessible and understandable by a layperson in accordance with best practices for communication styles that ensure that those agreeing to or signing the Contract understand the roles, actions, obligations, responsibilities, and implication of the agreement.
subclass of: BackboneElement
subclass of:
  union of: Restriction
    cardinality: 1
    on property: Contract.friendly.contentAttachment
    some values from: Attachment
  union of: Restriction
    cardinality: 1
    on property: Contract.friendly.contentReference
    some values from: Reference

Group.name
type: ObjectProperty
comment: A label assigned to the group for human identification and communication.
domain: Group
range: string
title: Label for Group

RequestGroup.action.relatedAction.actionId
type: ObjectProperty
comment: The element id of the action this is related to.
domain: RequestGroupActionComponent.RequestGroupActionRelatedActionComponent
range: id
title: What action this is related to

ImagingStudy.series.laterality
type: ObjectProperty
comment: The laterality of the (possibly paired) anatomic structures examined. E.g., the left knee, both lungs, or unpaired abdomen. If present, shall be consistent with any laterality information indicated in ImagingStudy.series.bodySite.
domain: ImagingStudySeriesComponent
range: Coding
title: Body part laterality

Questionnaire.item.item.initial.value
type: ObjectProperty

ImagingStudy.identifier
type: ObjectProperty
comment: DICOM Study Instance UID, and Accession Number.
domain: ImagingStudy
range: Identifier
sub property of: id
title: Identifiers for the whole study

ClaimResponse.addItem.detail.subDetail.factor
type: ObjectProperty
comment: A real number that represents a multiplier used in determining the overall value of services delivered and/or goods received. The concept of a Factor allows for a discount or surcharge multiplier to be applied to a monetary amount.
domain: ClaimResponse.AddedItemComponent.AddedItemDetailComponent.AddedItemSubDetailComponent
range: decimal
title: Price scaling factor

Consent.source
type: ObjectProperty

CodeSystem.concept.property.valueDateTime
type: ObjectProperty
domain: CodeSystem.ConceptDefinitionComponent.ConceptPropertyComponent
range: dateTime
sub property of: CodeSystem.concept.property.value

Identifier.system
type: ObjectProperty
comment: Establishes the namespace for the value - that is, a URL that describes a set values that are unique.
domain: Identifier
range: uri
title: The namespace for the identifier value

Questionnaire.item.initial.valueUri
type: ObjectProperty
domain: QuestionnaireItemComponent.QuestionnaireItemInitialComponent
range: uri
sub property of: Questionnaire.item.initial.value

TestScript.variable
type: ObjectProperty
comment: Variable is set based either on element value in response body or on header field value in the response headers.
domain: TestScript
range: TestScriptVariableComponent
title: Placeholder for evaluated elements

RelatedPerson.patient
type: ObjectProperty
comment: The patient this person is related to.
domain: RelatedPerson
range: Reference
title: The patient this person is related to

PlanDefinition.goal
type: ObjectProperty
comment: Goals that describe what the activities within the plan are intended to achieve. For example, weight loss, restoring an activity of daily living, obtaining herd immunity via immunization, meeting a process improvement objective, etc.
domain: PlanDefinition
range: PlanDefinitionGoalComponent
title: What the plan is trying to accomplish

PlanDefinition.action.action.timingAge
type: ObjectProperty
domain: PlanDefinitionActionComponentAction
range: Age
sub property of: PlanDefinition.action.action.timing

Contract.TermComponentTerm.ContractOfferComponent
type: Class
comment: The matter of concern in the context of this provision of the agrement.
subclass of: BackboneElement
subclass of: Restriction
  all values from: CodeableConcept
  on property: Contract.term.group.offer.decisionMode
subclass of: Restriction
  all values from: Reference
  max cardinality: 1
  on property: Contract.term.group.offer.topic
subclass of: Restriction
  all values from: unsignedInt
  on property: Contract.term.group.offer.securityLabelNumber
subclass of: Restriction
  all values from: Contract.TermComponentTerm.ContractOfferComponent.ContractPartyComponent
  on property: Contract.term.group.offer.party
subclass of: Restriction
  all values from: string
  on property: Contract.term.group.offer.linkId
subclass of: Restriction
  all values from: CodeableConcept
  max cardinality: 1
  on property: Contract.term.group.offer.decision
subclass of: Restriction
  all values from: string
  max cardinality: 1
  on property: Contract.term.group.offer.text
subclass of: Restriction
  all values from: CodeableConcept
  max cardinality: 1
  on property: Contract.term.group.offer.type
subclass of: Restriction
  all values from: Contract.TermComponentTerm.ContractOfferComponent.AnswerComponent
  on property: Contract.term.group.offer.answer
subclass of: Restriction
  all values from: Identifier
  on property: Contract.term.group.offer.identifier

MessageDefinition.parent
type: ObjectProperty
comment: Identifies a protocol or workflow that this MessageDefinition represents a step in.
domain: MessageDefinition
range: canonical
title: Protocol/workflow this is part of

HealthcareService.providedBy
type: ObjectProperty
comment: The organization that provides this healthcare service.
domain: HealthcareService
range: Reference
title: Organization that provides this service

ExampleScenarioProcessComponent.ExampleScenarioProcessStepComponent.ExampleScenarioProcessStepAlternativeComponent.ExampleScenarioProcessStepAlternativeOptionComponentStep.ExampleScenarioProcessStepOperationComponent
type: Class
comment: Each interaction or action.
subclass of: BackboneElement
subclass of: Restriction
  all values from: string
  max cardinality: 1
  on property: ExampleScenario.process.step.alternative.option.step.operation.initiator
subclass of: Restriction
  cardinality: 1
  on property: ExampleScenario.process.step.alternative.option.step.operation.number
  some values from: string
subclass of: Restriction
  all values from: ExampleScenarioProcessComponent.ExampleScenarioProcessStepComponent.ExampleScenarioProcessStepAlternativeComponent.ExampleScenarioProcessStepAlternativeOptionComponentStep.ExampleScenarioProcessStepOperationComponentContainedInstance
  max cardinality: 1
  on property: ExampleScenario.process.step.alternative.option.step.operation.response
subclass of: Restriction
  all values from: string
  max cardinality: 1
  on property: ExampleScenario.process.step.alternative.option.step.operation.name
subclass of: Restriction
  all values from: boolean
  max cardinality: 1
  on property: ExampleScenario.process.step.alternative.option.step.operation.receiverActive
subclass of: Restriction
  all values from: ExampleScenarioProcessComponent.ExampleScenarioProcessStepComponent.ExampleScenarioProcessStepAlternativeComponent.ExampleScenarioProcessStepAlternativeOptionComponentStep.ExampleScenarioProcessStepOperationComponentContainedInstance
  max cardinality: 1
  on property: ExampleScenario.process.step.alternative.option.step.operation.request
subclass of: Restriction
  all values from: boolean
  max cardinality: 1
  on property: ExampleScenario.process.step.alternative.option.step.operation.initiatorActive
subclass of: Restriction
  all values from: markdown
  max cardinality: 1
  on property: ExampleScenario.process.step.alternative.option.step.operation.description
subclass of: Restriction
  all values from: string
  max cardinality: 1
  on property: ExampleScenario.process.step.alternative.option.step.operation.receiver
subclass of: Restriction
  all values from: string
  max cardinality: 1
  on property: ExampleScenario.process.step.alternative.option.step.operation.type

CoverageEligibilityRequest.item.facility
type: ObjectProperty
comment: Facility where the services were provided.
domain: CoverageEligibilityRequest.DetailsComponent
range: Reference
title: Servicing Facility

MedicationRequest.dispenseRequest.quantity
type: ObjectProperty
comment: The amount that is to be dispensed for one fill.
domain: MedicationRequestDispenseRequestComponent
range: SimpleQuantity
title: Amount of medication to supply per dispense

SpecimenDefinition.specimenToLab.containerAdditive
type: ObjectProperty
comment: Substance introduced in the kind of container to preserve, maintain or enhance the specimen. Examples: Formalin, Citrate, EDTA.
domain: SpecimenDefinitionSpecimenToLabComponent
range: SpecimenDefinitionSpecimenToLabComponent.SpecimenDefinitionSpecimenToLabContainerAdditiveComponent
title: Additive associated with container

QuestionnaireResponse.subject
type: ObjectProperty
comment: The subject of the questionnaire response. This could be a patient, organization, practitioner, device, etc. This is who/what the answers apply to, but is not necessarily the source of information.
domain: QuestionnaireResponse
range: Reference
sub property of: who.focus
title: The subject of the questions

MedicationAdministration
type: Class
comment: Describes the event of a patient consuming or otherwise being administered a medication. This may be as simple as swallowing a tablet or it may be a long running infusion. Related resources tie this event to the authorizing prescription, and the specific encounter between patient and health care practitioner.
subclass of: clinical.medication
subclass of: DomainResource
subclass of: Restriction
  all values from: Reference
  max cardinality: 1
  on property: MedicationAdministration.context
subclass of: Restriction
  all values from: Reference
  on property: MedicationAdministration.reasonReference
subclass of: Restriction
  all values from: uri
  on property: MedicationAdministration.instantiates
subclass of: Restriction
  all values from: MedicationAdministrationPerformerComponent
  on property: MedicationAdministration.performer
subclass of: Restriction
  cardinality: 1
  on property: MedicationAdministration.subject
  some values from: Reference
subclass of: Restriction
  all values from: CodeableConcept
  max cardinality: 1
  on property: MedicationAdministration.category
subclass of: Restriction
  all values from: CodeableConcept
  on property: MedicationAdministration.reasonCode
subclass of: Restriction
  all values from: Annotation
  on property: MedicationAdministration.note
subclass of:
  union of: Restriction
    cardinality: 1
    on property: MedicationAdministration.medicationCodeableConcept
    some values from: CodeableConcept
  union of: Restriction
    cardinality: 1
    on property: MedicationAdministration.medicationReference
    some values from: Reference
subclass of: Restriction
  all values from: Identifier
  on property: MedicationAdministration.identifier
subclass of: Restriction
  all values from: Reference
  on property: MedicationAdministration.eventHistory
subclass of:
  union of: Restriction
    cardinality: 1
    on property: MedicationAdministration.effectiveDateTime
    some values from: dateTime
  union of: Restriction
    cardinality: 1
    on property: MedicationAdministration.effectivePeriod
    some values from: Period
subclass of: Restriction
  all values from: Reference
  on property: MedicationAdministration.supportingInformation
subclass of: Restriction
  all values from: Reference
  max cardinality: 1
  on property: MedicationAdministration.request
subclass of: Restriction
  all values from: CodeableConcept
  on property: MedicationAdministration.statusReason
subclass of: Restriction
  all values from: Reference
  on property: MedicationAdministration.device
subclass of: Restriction
  cardinality: 1
  on property: MedicationAdministration.status
  some values from: code
subclass of: Restriction
  all values from: Reference
  on property: MedicationAdministration.partOf
subclass of: Restriction
  all values from: MedicationAdministrationDosageComponent
  max cardinality: 1
  on property: MedicationAdministration.dosage

MedicinalProductAuthorization.jurisdictionalAuthorization
type: ObjectProperty
comment: Authorization in areas within a country.
domain: MedicinalProductAuthorization
range: MedicinalProductAuthorizationJurisdictionalAuthorizationComponent
title: Authorization in areas within a country

Coverage.status
type: ObjectProperty
comment: The status of the resource instance.
domain: Coverage
range: code
sub property of: status
title: active | cancelled | draft | entered-in-error

Appointment.serviceType
type: ObjectProperty
comment: The specific service that is to be performed during this appointment.
domain: Appointment
range: CodeableConcept
title: The specific service that is to be performed during this appointment

MessageHeader.response.identifier
type: ObjectProperty
comment: The MessageHeader.id of the message to which this message is a response.
domain: MessageHeaderResponseComponent
range: id
title: Id of original message

Contract.term.offer.decisionMode
type: ObjectProperty
comment: How the decision about a Contract was conveyed.
domain: Contract.TermComponent.ContractOfferComponent
range: CodeableConcept
title: How decision is conveyed

Claim.item.locationAddress
type: ObjectProperty
domain: Claim.ItemComponent
range: Address
sub property of: Claim.item.location

InsurancePlanCoverageComponent.CoverageBenefitComponent
type: Class
comment: Specific benefits under this type of coverage.
subclass of: BackboneElement
subclass of: Restriction
  all values from: InsurancePlanCoverageComponent.CoverageBenefitComponent.CoverageBenefitLimitComponent
  on property: InsurancePlan.coverage.benefit.limit
subclass of: Restriction
  all values from: string
  max cardinality: 1
  on property: InsurancePlan.coverage.benefit.requirement
subclass of: Restriction
  cardinality: 1
  on property: InsurancePlan.coverage.benefit.type
  some values from: CodeableConcept

HealthcareService.active
type: ObjectProperty
comment: This flag is used to mark the record to not be used. This is not used when a center is closed for maintenance, or for holidays, the notAvailable period is to be used for this.
domain: HealthcareService
range: boolean
sub property of: status
title: Whether this HealthcareService record is in active use

SubstanceReferenceInformation.classification.source
type: ObjectProperty
comment: Todo.
domain: SubstanceReferenceInformationClassificationComponent
range: Reference
title: Todo

CapabilityStatement.rest.operation.definition
type: ObjectProperty
comment: Where the formal definition can be found.
domain: CapabilityStatementRestComponentOperation
range: canonical
title: The defined operation/query

QuestionnaireResponse.item.answer.item.answer.valueBoolean
type: ObjectProperty
domain: QuestionnaireResponseItemComponent.QuestionnaireResponseItemAnswerComponentItem.QuestionnaireResponseItemAnswerComponent
range: boolean
sub property of: QuestionnaireResponse.item.answer.item.answer.value

PlanDefinition.action.action.transform
type: ObjectProperty
comment: A reference to a StructureMap resource that defines a transform that can be executed to produce the intent resource using the ActivityDefinition instance as the input.
domain: PlanDefinitionActionComponentAction
range: canonical
title: Transform to apply the template

NutritionOrder.enteralFormula
type: ObjectProperty
comment: Feeding provided through the gastrointestinal tract via a tube, catheter, or stoma that delivers nutrition distal to the oral cavity.
domain: NutritionOrder
range: NutritionOrderEnteralFormulaComponent
title: Enteral formula components

Contract.term.group.action.reasonCode
type: ObjectProperty
comment: Rationale for the action to be performed or not performed. Describes why the action is permitted or prohibited.
domain: Contract.TermComponentTerm.ActionComponent
range: CodeableConcept
title: Why is action (not) needed?

ExampleScenario.process.step.alternative.option.step.process.step.operation.request.resourceId
type: ObjectProperty
comment: Each resource contained in the instance.
domain: Each resource instance used by the initiator
range: string
title: Each resource contained in the instance

TestScript.setup.action.operation.origin
type: ObjectProperty
comment: The server where the request message originates from. Must be one of the server numbers listed in TestScript.origin section.
domain: TestScriptSetupComponent.SetupActionComponent.SetupActionOperationComponent
range: integer
title: Server initiating the request

Slot.serviceCategory
type: ObjectProperty
comment: A broad categorization of the service that is to be performed during this appointment.
domain: Slot
range: CodeableConcept
sub property of: class
title: A broad categorization of the service that is to be performed during this appointment

Medication.manufacturer
type: ObjectProperty
comment: Describes the details of the manufacturer of the medication product. This is not intended to represent the distributor of a medication product.
domain: Medication
range: Reference
sub property of: who.actor
title: Manufacturer of the item

SupplyDelivery.suppliedItem.quantity
type: ObjectProperty
comment: The amount of supply that has been dispensed. Includes unit of measure.
domain: SupplyDeliverySuppliedItemComponent
range: SimpleQuantity
title: Amount dispensed

QuestionnaireResponse.item.answer.item.answer.item
type: ObjectProperty
comment: Nested groups and/or questions found within this particular answer.
domain: QuestionnaireResponseItemComponent.QuestionnaireResponseItemAnswerComponentItem.QuestionnaireResponseItemAnswerComponent
range: QuestionnaireResponseItemComponent.QuestionnaireResponseItemAnswerComponentItem.QuestionnaireResponseItemAnswerComponentItem
title: Nested groups and questions

Contract.topicCodeableConcept
type: ObjectProperty
domain: Contract
range: CodeableConcept
sub property of: Contract.topic

ObservationDefinition.qualifiedInterval.condition
type: ObjectProperty
comment: Text based condition for which the reference range is valid.
domain: ObservationDefinitionQualifiedIntervalComponent
range: string
title: Condition associated with the reference range

CoverageEligibilityResponse.insurance.item.provider
type: ObjectProperty
comment: The practitioner who is responsible for the services rendered to the patient.
domain: CoverageEligibilityResponse.InsuranceComponent.ItemsComponent
range: Reference
sub property of: who.source
title: Performing practitioner

Procedure.focalDevice
type: ObjectProperty
comment: A device that is implanted, removed or otherwise manipulated (calibration, battery replacement, fitting a prosthesis, attaching a wound-vac, etc.) as a focal portion of the Procedure.
domain: Procedure
range: ProcedureFocalDeviceComponent
title: Manipulated, implanted, or removed device

Annotation.authorReference
type: ObjectProperty
domain: Annotation
range: Reference
sub property of: Annotation.author

ValueSet.compose.exclude.concept.designation.use
type: ObjectProperty
comment: A code that represents types of uses of designations.
domain: ValueSetComposeComponentInclude.ConceptReferenceComponent.ConceptReferenceDesignationComponent
range: Coding
title: Types of uses of designations

GuidanceResponse
type: Class
comment: A guidance response is the formal response to a guidance request, including any output parameters returned by the evaluation, as well as the description of any proposed actions to be taken.
subclass of: DomainResource
subclass of: clinical.general
subclass of: Restriction
  all values from: Reference
  max cardinality: 1
  on property: GuidanceResponse.result
subclass of: Restriction
  all values from: Reference
  max cardinality: 1
  on property: GuidanceResponse.outputParameters
subclass of: Restriction
  all values from: Identifier
  on property: GuidanceResponse.identifier
subclass of: Restriction
  all values from: Reference
  on property: GuidanceResponse.reasonReference
subclass of: Restriction
  all values from: CodeableConcept
  on property: GuidanceResponse.reasonCode
subclass of: Restriction
  all values from: Identifier
  max cardinality: 1
  on property: GuidanceResponse.requestIdentifier
subclass of: Restriction
  all values from: Reference
  max cardinality: 1
  on property: GuidanceResponse.subject
subclass of: Restriction
  cardinality: 1
  on property: GuidanceResponse.status
  some values from: code
subclass of: Restriction
  all values from: Annotation
  on property: GuidanceResponse.note
subclass of: Restriction
  all values from: dateTime
  max cardinality: 1
  on property: GuidanceResponse.occurrenceDateTime
subclass of:
  union of: Restriction
    cardinality: 1
    on property: GuidanceResponse.moduleUri
    some values from: uri
  union of: Restriction
    cardinality: 1
    on property: GuidanceResponse.moduleCanonical
    some values from: canonical
  union of: Restriction
    cardinality: 1
    on property: GuidanceResponse.moduleCodeableConcept
    some values from: CodeableConcept
subclass of: Restriction
  all values from: DataRequirement
  on property: GuidanceResponse.dataRequirement
subclass of: Restriction
  all values from: Reference
  max cardinality: 1
  on property: GuidanceResponse.context
subclass of: Restriction
  all values from: Reference
  on property: GuidanceResponse.evaluationMessage
subclass of: Restriction
  all values from: Reference
  max cardinality: 1
  on property: GuidanceResponse.performer

MedicinalProductClinicals.contraindication.population.age
type: ObjectProperty

MedicationDispense.medicationCodeableConcept
type: ObjectProperty
domain: MedicationDispense
range: CodeableConcept
sub property of: MedicationDispense.medication

Specimen.processing.time
type: ObjectProperty

Observation.valueRatio
type: ObjectProperty
domain: Observation
range: Ratio
sub property of: Observation.value

RequestGroup.action.selectionBehavior
type: ObjectProperty
comment: Defines the selection behavior for the action and its children.
domain: RequestGroupActionComponent
range: code
title: any | all | all-or-none | exactly-one | at-most-one | one-or-more

ClaimResponse.addItem.unitPrice
type: ObjectProperty
comment: If the item is a node then this is the fee for the product or service, otherwise this is the total of the fees for the children of the group.
domain: ClaimResponse.AddedItemComponent
range: Money
title: Fee, charge or cost per point

Composition.section.emptyReason
type: ObjectProperty
comment: If the section is empty, why the list is empty. An empty section typically has some text explaining the empty reason.
domain: Composition.SectionComponent
range: CodeableConcept
title: Why the section is empty

Media.context
type: ObjectProperty
comment: The encounter or episode of care that establishes the context for this media.
domain: Media
range: Reference
sub property of: context
title: Encounter / Episode associated with media

TestScript.test.action.assert.rule
type: ObjectProperty
comment: The TestScript.rule this assert will evaluate.
domain: TestScriptTestComponent.TestActionComponentAssert
range: TestScriptTestComponent.TestActionComponentAssert.ActionAssertRuleComponent
title: The reference to a TestScript.rule

SubstanceReferenceInformation.target.type
type: ObjectProperty
comment: Todo.
domain: SubstanceReferenceInformationTargetComponent
range: CodeableConcept
title: Todo

DocumentManifest.identifier
type: ObjectProperty
comment: Other identifiers associated with the document manifest, including version independent identifiers.
domain: DocumentManifest
range: Identifier
sub property of: id
title: Other identifiers for the manifest

HealthcareService.type
type: ObjectProperty
comment: The specific type of service that may be delivered or performed.
domain: HealthcareService
range: CodeableConcept
title: Type of service that may be delivered or performed

ImagingStudy.referrer
type: ObjectProperty
comment: The requesting/referring physician.
domain: ImagingStudy
range: Reference
sub property of: who.cause
title: Referring physician

Meta.security
type: ObjectProperty
comment: Security labels applied to this resource. These tags connect specific resources to the overall security policy and infrastructure.
domain: Meta
range: Coding
title: Security Labels applied to this resource

VerificationResult.validator.signedValidatorAttestationString
type: ObjectProperty
domain: VerificationResultValidatorComponent
range: string
sub property of: VerificationResult.validator.signedValidatorAttestation

VisionPrescription.dispense.brand
type: ObjectProperty
comment: Brand recommendations or restrictions.
domain: VisionPrescriptionDispenseComponent
range: string
title: Brand required

Patient.contact
type: ObjectProperty
comment: A contact party (e.g. guardian, partner, friend) for the patient.
domain: Patient
range: Patient.ContactComponent
title: A contact party (e.g. guardian, partner, friend) for the patient

DeviceUseStatement.device
type: ObjectProperty
comment: The details of the device used.
domain: DeviceUseStatement
range: Reference
sub property of: who.actor
title: Reference to device used

ProductShelfLife.period
type: ObjectProperty
comment: The shelf life time period can be specified using a numerical value for the period of time and its unit of time measurement The unit of measurement shall be specified in accordance with ISO 11240 and the resulting terminology The symbol and the symbol identifier shall be used.
domain: ProductShelfLife
range: Quantity
title: The shelf life time period can be specified using a numerical value for the period of time and its unit of time measurement The unit of measurement shall be specified in accordance with ISO 11240 and the resulting terminology The symbol and the symbol identifier shall be used

TestScript.setup.action.operation
type: ObjectProperty
comment: The operation to perform.
domain: TestScriptSetupComponent.SetupActionComponent
range: TestScriptSetupComponent.SetupActionComponent.SetupActionOperationComponent
title: The setup operation to perform

RequestGroup.instantiatesUri
type: ObjectProperty
comment: A URL referencing an externally defined protocol, guideline, orderset or other definition that is adhered to in whole or in part by this request.
domain: RequestGroup
range: uri
title: Instantiates external protocol or definition

NutritionOrder.enteralFormula.additiveType
type: ObjectProperty
comment: Indicates the type of modular component such as protein, carbohydrate, fat or fiber to be provided in addition to or mixed with the base formula.
domain: NutritionOrderEnteralFormulaComponent
range: CodeableConcept
sub property of: what
title: Type of modular component to add to the feeding

ExplanationOfBenefit.item.servicedDate
type: ObjectProperty
domain: ExplanationOfBenefit.ItemComponent
range: date
sub property of: ExplanationOfBenefit.item.serviced

MessageHeader.source.name
type: ObjectProperty
comment: Human-readable name for the source system.
domain: MessageHeader.MessageSourceComponent
range: string
title: Name of system

ExplanationOfBenefit.ItemComponent.DetailComponent.SubDetailComponentAdjudication
type: Class
comment: The adjudication results.
subclass of: BackboneElement
subclass of: Restriction
  all values from: decimal
  max cardinality: 1
  on property: ExplanationOfBenefit.item.detail.subDetail.adjudication.value
subclass of: Restriction
  all values from: Money
  max cardinality: 1
  on property: ExplanationOfBenefit.item.detail.subDetail.adjudication.amount
subclass of: Restriction
  all values from: CodeableConcept
  max cardinality: 1
  on property: ExplanationOfBenefit.item.detail.subDetail.adjudication.reason
subclass of: Restriction
  cardinality: 1
  on property: ExplanationOfBenefit.item.detail.subDetail.adjudication.category
  some values from: CodeableConcept
title: Language if different from the resource

ConceptMap.group.element.target.dependsOn
type: ObjectProperty
comment: A set of additional dependencies for this mapping to hold. This mapping is only applicable if the specified element can be resolved, and it has the specified value.
domain: ConceptMapGroupComponent.SourceElementComponent.TargetElementComponent
range: ConceptMapGroupComponent.SourceElementComponent.TargetElementComponent.OtherElementComponent
title: Other elements required for this mapping (from context)

CapabilityStatement.implementationGuide
type: ObjectProperty
comment: A list of implementation guides that the server does (or should) support in their entirety.
domain: CapabilityStatement
range: canonical
title: Implementation guides supported

Substance.status
type: ObjectProperty
comment: A code to indicate if the substance is actively used.
domain: Substance
range: code
sub property of: status
title: active | inactive | entered-in-error

EpisodeOfCare.referralRequest
type: ObjectProperty
comment: Referral Request(s) that are fulfilled by this EpisodeOfCare, incoming referrals.
domain: EpisodeOfCare
range: Reference
title: Originating Referral Request(s)

ImplementationGuide.packageId
type: ObjectProperty
comment: The NPM package name for this Implementation Guide, used in the NPM package distribution, which is the primary mechanism by which FHIR based tooling manages IG dependencies. This value must be globally unique, and should be assigned with care.
domain: ImplementationGuide
range: id
title: NPM Package name for IG

Slot.status
type: ObjectProperty
comment: busy | free | busy-unavailable | busy-tentative | entered-in-error.
domain: Slot
range: code
title: busy | free | busy-unavailable | busy-tentative | entered-in-error

MedicinalProduct.identifier
type: ObjectProperty
comment: Business idenfifier for this product. Could be an MPID.
domain: MedicinalProduct
range: Identifier
title: Business idenfifier for this product. Could be an MPID

DocumentManifest.type
type: ObjectProperty
comment: The code specifying the type of clinical activity that resulted in placing the associated content into the DocumentManifest.
domain: DocumentManifest
range: CodeableConcept
sub property of: class
title: Kind of document set

BundleEntryComponentLink
type: Class
comment: A series of links that provide context to this entry.
subclass of: BackboneElement
subclass of: Restriction
  cardinality: 1
  on property: Bundle.entry.link.url
  some values from: uri
subclass of: Restriction
  cardinality: 1
  on property: Bundle.entry.link.relation
  some values from: string
title: Links related to this entry

OperationDefinition.parameter.part.referencedFrom.source
type: ObjectProperty
comment: The name of the parameter or dot-separated path of parameter names pointing to the resource parameter that is expected to contain a reference to this resource.
domain: OperationDefinitionParameterComponentParameter.OperationDefinitionParameterReferencedFromComponent
range: string
title: Referencing parameter

GraphDefinition.link.target.compartment
type: ObjectProperty
comment: Compartment Consistency Rules.
domain: GraphDefinitionLinkComponent.GraphDefinitionLinkTargetComponent
range: GraphDefinitionLinkComponent.GraphDefinitionLinkTargetComponent.GraphDefinitionLinkTargetCompartmentComponent
title: Compartment Consistency Rules

NutritionOrder.instantiatesCanonical
type: ObjectProperty
comment: The URL pointing to a FHIR-defined protocol, guideline, orderset or other definition that is adhered to in whole or in part by this NutritionOrder.
domain: NutritionOrder
range: canonical
title: Instantiates FHIR protocol or definition

Contract.term.action.status
type: ObjectProperty
comment: Current state of the term action.
domain: Contract.TermComponent.ActionComponent
range: CodeableConcept
title: State of the action

DocumentReferenceContentComponent
type: Class
comment: The document and format referenced. There may be multiple content element repetitions, each with a different format.
subclass of: BackboneElement
subclass of: Restriction
  all values from: Coding
  max cardinality: 1
  on property: DocumentReference.content.format
subclass of: Restriction
  cardinality: 1
  on property: DocumentReference.content.attachment
  some values from: Attachment

InsurancePlan.plan.generalCost.groupSize
type: ObjectProperty
comment: Number of participants enrolled in the plan.
domain: InsurancePlanPlanComponent.InsurancePlanPlanGeneralCostComponent
range: positiveInt
title: Number of enrollees

Expression.description
type: ObjectProperty
comment: A brief, natural language description of the condition that effectively communicates the intended semantics.
domain: Expression
range: string
title: Natural language description of the condition

Immunization.education.presentationDate
type: ObjectProperty
comment: Date the educational material was given to the patient.
domain: ImmunizationEducationComponent
range: dateTime
title: Educational material presentation date

Encounter.serviceType
type: ObjectProperty
comment: Broad categorization of the service that is to be provided (e.g. cardiology).
domain: Encounter
range: CodeableConcept
title: Specific type of service

ExampleScenario.process.step.process.step.operation.response
type: ObjectProperty
comment: Each resource instance used by the responder.
domain: ExampleScenarioProcessComponent.ExampleScenarioProcessStepComponentProcess.ExampleScenarioProcessStepComponent.ExampleScenarioProcessStepOperationComponent
range: ExampleScenarioProcessComponent.ExampleScenarioProcessStepComponentProcess.ExampleScenarioProcessStepComponent.ExampleScenarioProcessStepOperationComponentContainedInstance
title: Each resource instance used by the responder

CodeSystemFilterComponent
type: Class
comment: A filter that can be used in a value set compose statement when selecting concepts using a filter.
subclass of: BackboneElement
subclass of: Restriction
  cardinality: 1
  on property: CodeSystem.filter.value
  some values from: string
subclass of: Restriction
  on property: CodeSystem.filter.operator
  some values from: code
subclass of: Restriction
  all values from: string
  max cardinality: 1
  on property: CodeSystem.filter.description
subclass of: Restriction
  cardinality: 1
  on property: CodeSystem.filter.code
  some values from: code

ExplanationOfBenefit.item.detail.subDetail.adjudication.category
type: ObjectProperty
comment: Code indicating: Co-Pay, deductable, elegible, benefit, tax, etc.
domain: ExplanationOfBenefit.ItemComponent.DetailComponent.SubDetailComponentAdjudication
range: CodeableConcept
title: Adjudication category such as co-pay, eligible, benefit, etc.

TestReport.participant.type
type: ObjectProperty
comment: The type of participant.
domain: TestReportParticipantComponent
range: code
title: test-engine | client | server

BiologicallyDerivedProduct.productCode
type: ObjectProperty
comment: A code that identifies the kind of this biologically derived product (SNOMED Ctcode).
domain: BiologicallyDerivedProduct
range: CodeableConcept
title: What this biologically derived product is

TerminologyCapabilities.codeSystem.version.filter
type: ObjectProperty
comment: Filter Properties supported.
domain: TerminologyCapabilitiesCodeSystemComponent.TerminologyCapabilitiesCodeSystemVersionComponent
range: TerminologyCapabilitiesCodeSystemComponent.TerminologyCapabilitiesCodeSystemVersionComponent.TerminologyCapabilitiesCodeSystemVersionFilterComponent
title: Filter Properties supported

MeasureReport.date
type: ObjectProperty
comment: The date this measure report was generated.
domain: MeasureReport
range: dateTime
sub property of: when.recorded
title: When the report was generated

Observation.component.code
type: ObjectProperty
comment: Describes what was observed. Sometimes this is called the observation "code".
domain: ObservationComponentComponent
range: CodeableConcept
sub property of: what
title: Type of component observation (code / type)

ValueSet.compose.exclude.filter.property
type: ObjectProperty
comment: A code that identifies a property defined in the code system.
domain: ValueSetComposeComponentInclude.ConceptSetFilterComponent
range: code
title: A property defined by the code system

EventDefinition.editor
type: ObjectProperty
comment: An individual or organization primarily responsible for internal coherence of the content.
domain: EventDefinition
range: ContactDetail
title: Who edited the content

MessageDefinition.version
type: ObjectProperty
comment: The identifier that is used to identify this version of the message definition when it is referenced in a specification, model, design or instance. This is an arbitrary value managed by the message definition author and is not expected to be globally unique. For example, it might be a timestamp (e.g. yyyymmdd) if a managed version is not available. There is also no expectation that versions can be placed in a lexicographical sequence.
domain: MessageDefinition
range: string
sub property of: id.version
title: Business version of the message definition

ExplanationOfBenefit.item.detail.subDetail.quantity
type: ObjectProperty
comment: The number of repetitions of a service or product.
domain: ExplanationOfBenefit.ItemComponent.DetailComponent.SubDetailComponent
range: SimpleQuantity
title: Count of Products or Services

ActivityDefinition.title
type: ObjectProperty
comment: A short, descriptive, user-friendly title for the activity definition.
domain: ActivityDefinition
range: string
title: Name for this activity definition (human friendly)

EpisodeOfCare.patient
type: ObjectProperty
comment: The patient who is the focus of this episode of care.
domain: EpisodeOfCare
range: Reference
sub property of: who.focus
title: The patient who is the focus of this episode of care

Contract.issued
type: ObjectProperty
comment: When this Contract was issued.
domain: Contract
range: dateTime
title: When this Contract was issued

ExplanationOfBenefit.addItem.detail
type: ObjectProperty
comment: The second-tier service adjudications for payor added services.
domain: ExplanationOfBenefit.AddedItemComponent
range: ExplanationOfBenefit.AddedItemComponent.AddedItemDetailComponent
title: Insurer added line items

MedicationKnowledge.regulatory.regulatoryAuthority
type: ObjectProperty
comment: The authority that is specifying the regulations.
domain: MedicationKnowledgeRegulatoryComponent
range: Reference
title: Specifies the authority of the regulation

ExplanationOfBenefit.item.detail.adjudication
type: ObjectProperty
comment: The adjudication results.
domain: ExplanationOfBenefit.ItemComponent.DetailComponent
range: ExplanationOfBenefit.ItemComponent.DetailComponentAdjudication
title: Detail level adjudication details

SubstanceSpecification.structure.isotope.substitutionType
type: ObjectProperty
comment: The type of isotopic substitution present in a single substance.
domain: SubstanceSpecificationStructureComponent.SubstanceSpecificationStructureIsotopeComponent
range: CodeableConcept
title: The type of isotopic substitution present in a single substance

Sequence.variant.referenceAllele
type: ObjectProperty
comment: An allele is one of a set of coexisting sequence variants of a gene ([SO:0001023](http://www.sequenceontology.org/browser/current_svn/term/SO:0001023)). Nucleotide(s)/amino acids from start position of sequence to stop position of sequence on the positive (+) strand of the reference sequence. When the sequence type is DNA, it should be the sequence on the positive (+) strand. This will lay in the range between variant.start and variant.end.
domain: SequenceVariantComponent
range: string
title: Allele in the reference sequence

BiologicallyDerivedProduct.quantity
type: ObjectProperty
comment: Number of discrete units within this product.
domain: BiologicallyDerivedProduct
range: integer
title: The amount of this biologically derived product

TestScript.test.action.assert.compareToSourceId
type: ObjectProperty
comment: Id of the source fixture used as the contents to be evaluated by either the "source/expression" or "sourceId/path" definition.
domain: TestScriptTestComponent.TestActionComponentAssert
range: string
title: Id of the source fixture to be evaluated

DeviceDefinition
type: Class
comment: The characteristics, operational status and capabilities of a medical-related component of a medical device.
subclass of: DomainResource
subclass of: administrative.device
subclass of: Restriction
  all values from: string
  max cardinality: 1
  on property: DeviceDefinition.modelNumber
subclass of: Restriction
  all values from: Reference
  max cardinality: 1
  on property: DeviceDefinition.parentDevice
subclass of: Restriction
  all values from: DeviceDefinitionCapabilityComponent
  on property: DeviceDefinition.capability
subclass of:
  union of: Restriction
    all values from: string
    max cardinality: 1
    on property: DeviceDefinition.manufacturerString
  union of: Restriction
    all values from: Reference
    max cardinality: 1
    on property: DeviceDefinition.manufacturerReference
subclass of: Restriction
  all values from: string
  on property: DeviceDefinition.version
subclass of: Restriction
  all values from: Identifier
  on property: DeviceDefinition.identifier
subclass of: Restriction
  all values from: Reference
  max cardinality: 1
  on property: DeviceDefinition.owner
subclass of: Restriction
  all values from: ProductShelfLife
  on property: DeviceDefinition.shelfLifeStorage
subclass of: Restriction
  all values from: CodeableConcept
  on property: DeviceDefinition.safety
subclass of: Restriction
  all values from: ContactPoint
  on property: DeviceDefinition.contact
subclass of: Restriction
  all values from: ProdCharacteristic
  max cardinality: 1
  on property: DeviceDefinition.physicalCharacteristics
subclass of: Restriction
  all values from: uri
  max cardinality: 1
  on property: DeviceDefinition.url
subclass of: Restriction
  all values from: DeviceDefinitionMaterialComponent
  on property: DeviceDefinition.material
subclass of: Restriction
  all values from: CodeableConcept
  on property: DeviceDefinition.languageCode
subclass of: Restriction
  all values from: DeviceDefinitionPropertyComponent
  on property: DeviceDefinition.property
subclass of: Restriction
  all values from: CodeableConcept
  max cardinality: 1
  on property: DeviceDefinition.type
subclass of: Restriction
  all values from: DeviceDefinitionUdiDeviceIdentifierComponent
  on property: DeviceDefinition.udiDeviceIdentifier
subclass of: Restriction
  all values from: uri
  max cardinality: 1
  on property: DeviceDefinition.onlineInformation
subclass of: Restriction
  all values from: Annotation
  on property: DeviceDefinition.note
subclass of: Restriction
  all values from: DeviceDefinitionDeviceNameComponent
  on property: DeviceDefinition.deviceName
subclass of: Restriction
  all values from: Quantity
  max cardinality: 1
  on property: DeviceDefinition.quantity
subclass of: Restriction
  all values from: DeviceDefinitionSpecializationComponent
  on property: DeviceDefinition.specialization

StructureMap.group.input.name
type: ObjectProperty
comment: Name for this instance of data.
domain: StructureMapGroupComponent.StructureMapGroupInputComponent
range: id
title: Name for this instance of data

SubstanceSpecification.substanceCode.code
type: ObjectProperty
comment: The specific code.
domain: SubstanceSpecificationSubstanceCodeComponent
range: CodeableConcept
title: The specific code

SubstanceMoiety.role
type: ObjectProperty
comment: The role of the moiety should be specified if there is a specific role the moiety is playing.
domain: SubstanceMoiety
range: CodeableConcept
title: The role of the moiety should be specified if there is a specific role the moiety is playing

TestScript.test.action.operation.params
type: ObjectProperty
comment: Path plus parameters after [type]. Used to set parts of the request URL explicitly.
domain: TestScriptTestComponent.TestActionComponentOperation
range: string
title: Explicitly defined path parameters

StructureMap.group.rule.source.check
type: ObjectProperty
comment: FHIRPath expression - must be true or the mapping engine throws an error instead of completing.
domain: StructureMapGroupComponent.StructureMapGroupRuleComponent.StructureMapGroupRuleSourceComponent
range: string
title: FHIRPath expression - must be true or the mapping engine throws an error instead of completing

PlanDefinition.action.requiredBehavior
type: ObjectProperty
comment: Defines the required behavior for the action.
domain: PlanDefinitionActionComponent
range: code
title: must | could | must-unless-documented

Contract.TermComponentTerm.ContractOfferComponent.ContractPartyComponent
type: Class
comment: Offer Recipient.
subclass of: BackboneElement
subclass of: Restriction
  cardinality: 1
  on property: Contract.term.group.offer.party.role
  some values from: CodeableConcept
subclass of: Restriction
  on property: Contract.term.group.offer.party.reference
  some values from: Reference

Consent.provision.provision.data
type: ObjectProperty
comment: The resources controlled by this rule if specific resources are referenced.
domain: Consent.provisionComponentProvision
range: Consent.provisionComponentProvision.provisionDataComponent
title: Data controlled by this rule

Specimen.request
type: ObjectProperty
comment: Details concerning a service request that required a specimen to be collected.
domain: Specimen
range: Reference
sub property of: why
title: Why the specimen was collected

TestScript.test.action.operation.requestHeader.value
type: ObjectProperty
comment: The value of the header e.g. "application/fhir+xml".
domain: TestScriptTestComponent.TestActionComponentOperation.SetupActionOperationRequestHeaderComponent
range: string
title: HTTP headerfield value

GuidanceResponse.module
type: ObjectProperty

SubstanceSpecification.structure.structuralRepresentation.type
type: ObjectProperty
comment: The type of structure (e.g. Full, Partial, Representative).
domain: SubstanceSpecificationStructureComponent.SubstanceSpecificationStructureStructuralRepresentationComponent
range: CodeableConcept
title: The type of structure (e.g. Full, Partial, Representative)

SubstanceSpecification.structure
type: ObjectProperty
comment: Structural information.
domain: SubstanceSpecification
range: SubstanceSpecificationStructureComponent
title: Structural information

QuestionnaireResponse.item.answer.valueDateTime
type: ObjectProperty
domain: QuestionnaireResponseItemComponent.QuestionnaireResponseItemAnswerComponent
range: dateTime
sub property of: QuestionnaireResponse.item.answer.value

ClinicalImpression.context
type: ObjectProperty
comment: The encounter or episode of care this impression was created as part of.
domain: ClinicalImpression
range: Reference
sub property of: context
title: Encounter or Episode created from

ClinicalImpression.note
type: ObjectProperty
comment: Commentary about the impression, typically recorded after the impression itself was made, though supplemental notes by the original author could also appear.
domain: ClinicalImpression
range: Annotation
title: Comments made about the ClinicalImpression

Task.insurance
type: ObjectProperty
comment: Insurance plans, coverage extensions, pre-authorizations and/or pre-determinations that may be relevant to the Task.
domain: Task
range: Reference
title: Associated insurance coverage

ActivityDefinition.copyright
type: ObjectProperty
comment: A copyright statement relating to the activity definition and/or its contents. Copyright statements are generally legal restrictions on the use and publishing of the activity definition.
domain: ActivityDefinition
range: markdown
title: Use and/or publishing restrictions

MedicationBatchComponent
type: Class
comment: Information that only applies to packages (not products).
subclass of: BackboneElement
subclass of: Restriction
  all values from: string
  max cardinality: 1
  on property: Medication.batch.serialNumber
subclass of: Restriction
  all values from: dateTime
  max cardinality: 1
  on property: Medication.batch.expirationDate
subclass of: Restriction
  all values from: string
  max cardinality: 1
  on property: Medication.batch.lotNumber

Consent.policy.authority
type: ObjectProperty
comment: Entity or Organization having regulatory jurisdiction or accountability for enforcing policies pertaining to Consent Directives.
domain: ConsentPolicyComponent
range: uri
title: Enforcement source for policy

TestScript.metadata.capability
type: ObjectProperty
comment: Capabilities that must exist and are assumed to function correctly on the FHIR server being tested.
domain: TestScriptMetadataComponent
range: TestScriptMetadataComponent.TestScriptMetadataCapabilityComponent
title: Capabilities that are assumed to function correctly on the FHIR server being tested

MedicinalProductDeviceSpec.otherCharacteristics
type: ObjectProperty
comment: Other codeable characteristics.
domain: MedicinalProductDeviceSpec
range: CodeableConcept
title: Other codeable characteristics

ChargeItemDefinition.instance
type: ObjectProperty
comment: The defined billing details in this resource pertain to the given product instance(s).
domain: ChargeItemDefinition
range: Reference
title: Instances this definition applies to

ImplementationGuide.dependsOn.packageId
type: ObjectProperty
comment: The NPM package name for the Implementation Guide that this IG depends on.
domain: ImplementationGuideDependsOnComponent
range: id
title: NPM Package name for IG this depends on

ActivityDefinition.url
type: ObjectProperty
comment: An absolute URI that is used to identify this activity definition when it is referenced in a specification, model, design or an instance; also called its canonical identifier. This SHOULD be globally unique and SHOULD be a literal address at which at which an authoritative instance of this activity definition is (or will be) published. This URL can be the target of a canonical reference. It SHALL remain the same when the activity definition is stored on different servers.
domain: ActivityDefinition
range: uri
sub property of: id
title: Canonical identifier for this activity definition, represented as a URI (globally unique)

Procedure.usedReference
type: ObjectProperty
comment: Identifies medications, devices and any other substance used as part of the procedure.
domain: Procedure
range: Reference
title: Items used during procedure

Questionnaire.item.item.text
type: ObjectProperty
comment: The name of a section, the text of a question or text content for a display item.
domain: QuestionnaireItemComponentItem
range: string
title: Primary text for the item

BodyStructure.identifier
type: ObjectProperty
comment: Identifier for this instance of the anatomical structure.
domain: BodyStructure
range: Identifier
sub property of: id
title: Bodystructure identifier

AuditEvent.action
type: ObjectProperty
comment: Indicator for type of action performed during the event that generated the audit.
domain: AuditEvent
range: code
sub property of: what
title: Type of action performed during the event

ElementDefinition.mapping.identity
type: ObjectProperty
comment: An internal reference to the definition of a mapping.
domain: ElementDefinitionMappingComponent
range: id
title: Reference to mapping declaration

Observation.status
type: ObjectProperty
comment: The status of the result value.
domain: Observation
range: code
sub property of: status
title: registered | preliminary | final | amended +

CodeSystem.filter.description
type: ObjectProperty
comment: A description of how or why the filter is used.
domain: CodeSystemFilterComponent
range: string
title: How or why the filter is used

Questionnaire.item.item.answerOption.valueString
type: ObjectProperty
domain: QuestionnaireItemComponentItem.QuestionnaireItemAnswerOptionComponent
range: string
sub property of: Questionnaire.item.item.answerOption.value

TestScript.setup.action.assert.ruleset.rule.param
type: ObjectProperty
comment: Each rule template can take one or more parameters for rule evaluation.
domain: TestScriptSetupComponent.SetupActionComponent.SetupActionAssertComponent.ActionAssertRulesetComponent.ActionAssertRulesetRuleComponent
range: TestScriptSetupComponent.SetupActionComponent.SetupActionAssertComponent.ActionAssertRulesetComponent.ActionAssertRulesetRuleComponent.ActionAssertRulesetRuleParamComponent
title: Rule parameter template

TestScript.metadata.link
type: ObjectProperty
comment: A link to the FHIR specification that this test is covering.
domain: TestScriptMetadataComponent
range: TestScriptMetadataComponent.TestScriptMetadataLinkComponent
title: Links to the FHIR specification

RequestGroup.action.action.condition.expression
type: ObjectProperty
comment: An expression that returns true or false, indicating whether or not the condition is satisfied.
domain: RequestGroupActionComponentAction.RequestGroupActionConditionComponent
range: string
title: Boolean-valued expression

ElementDefinition.maxValueDate
type: ObjectProperty
domain: ElementDefinition
range: date
sub property of: ElementDefinition.maxValue

Contract.term.group.offer.answer.valueReference
type: ObjectProperty
domain: Contract.TermComponentTerm.ContractOfferComponent.AnswerComponent
range: Reference
sub property of: Contract.term.group.offer.answer.value

Person.birthDate
type: ObjectProperty
comment: The birth date for the person.
domain: Person
range: date
title: The date on which the person was born

Contract.term.group.asset.valuedItem.payment
type: ObjectProperty
comment: Terms of valuation.
domain: Contract.TermComponentTerm.ContractAssetComponent.ValuedItemComponent
range: string
title: Terms of valuation

Claim.item.detail.programCode
type: ObjectProperty
comment: For programs which require reson codes for the inclusion, covering, of this billed item under the program or sub-program.
domain: Claim.ItemComponent.DetailComponent
range: CodeableConcept
title: Program specific reason for item inclusion

ElementDefinition.minValueQuantity
type: ObjectProperty
domain: ElementDefinition
range: Quantity
sub property of: ElementDefinition.minValue

BiologicallyDerivedProduct.collection.collected
type: ObjectProperty

RelatedPerson.identifier
type: ObjectProperty
comment: Identifier for a person within a particular scope.
domain: RelatedPerson
range: Identifier
sub property of: id
title: A human identifier for this person

Narrative.status
type: ObjectProperty
comment: The status of the narrative - whether it's entirely generated (from just the defined data or the extensions too), or whether a human authored it and it may contain additional data.
domain: Narrative
range: code
title: generated | extensions | additional | empty

InsurancePlan.plan.network
type: ObjectProperty
comment: Reference to the network that providing the type of coverage.
domain: InsurancePlanPlanComponent
range: Reference
title: What networks provide coverage

CarePlan.activity.detail.scheduledString
type: ObjectProperty
domain: CarePlanActivityComponent.CarePlanActivityDetailComponent
range: string
sub property of: CarePlan.activity.detail.scheduled

ClinicalImpression.finding
type: ObjectProperty
comment: Specific findings or diagnoses that was considered likely or relevant to ongoing treatment.
domain: ClinicalImpression
range: ClinicalImpressionFindingComponent
title: Possible or likely findings and diagnoses

Linkage.active
type: ObjectProperty
comment: Indicates whether the asserted set of linkages are considered to be "in effect".
domain: Linkage
range: boolean
sub property of: status
title: Whether this linkage assertion is active or not

Contract.term.action.requesterLinkId
type: ObjectProperty
comment: Id [identifier??] of the clause or question text related to the requester of this action in the referenced form or QuestionnaireResponse.
domain: Contract.TermComponent.ActionComponent
range: string
title: Pointer to specific item

PlanDefinition.action
type: ObjectProperty
comment: An action or group of actions to be taken as part of the plan.
domain: PlanDefinition
range: PlanDefinitionActionComponent
title: Action defined by the plan

MedicinalProductAuthorization.legalStatusOfSupply
type: ObjectProperty
comment: The legal status of supply of the medicinal product as classified by the regulator.
domain: MedicinalProductAuthorization
range: CodeableConcept
title: The legal status of supply of the medicinal product as classified by the regulator

HealthcareService.category
type: ObjectProperty
comment: Identifies the broad category of service being performed or delivered.
domain: HealthcareService
range: CodeableConcept
sub property of: class
title: Broad category of service being performed or delivered

StructureMap.group.typeMode
type: ObjectProperty
comment: If this is the default rule set to apply for the source type or this combination of types.
domain: StructureMapGroupComponent
range: code
title: none | types | type-and-types

Linkage.item
type: ObjectProperty
comment: Identifies one of the records that is considered to refer to the same real-world occurrence as well as how the items should be evaluated within the collection of linked items.
domain: Linkage
range: LinkageItemComponent
title: Item to be linked

ExplanationOfBenefit.AccidentComponent
type: Class
comment: An accident which resulted in the need for healthcare services.
subclass of: BackboneElement
subclass of:
  union of: Restriction
    all values from: Address
    max cardinality: 1
    on property: ExplanationOfBenefit.accident.locationAddress
  union of: Restriction
    all values from: Reference
    max cardinality: 1
    on property: ExplanationOfBenefit.accident.locationReference
subclass of: Restriction
  all values from: CodeableConcept
  max cardinality: 1
  on property: ExplanationOfBenefit.accident.type
subclass of: Restriction
  all values from: date
  max cardinality: 1
  on property: ExplanationOfBenefit.accident.date

CarePlan.contributor
type: ObjectProperty
comment: Identifies the individual(s) or organization who provided the contents of the care plan.
domain: CarePlan
range: Reference
title: Who provided the content of the care plan

CompartmentDefinition.date
type: ObjectProperty
comment: The date (and optionally time) when the compartment definition was published. The date must change when the business version changes and it must change if the status code changes. In addition, it should change when the substantive content of the compartment definition changes.
domain: CompartmentDefinition
range: dateTime
sub property of: when.recorded
title: Date last changed

CoverageEligibilityRequest.serviced
type: ObjectProperty

CodeSystem.concept.concept.property.valueCoding
type: ObjectProperty
domain: CodeSystem.ConceptDefinitionComponentConcept.ConceptPropertyComponent
range: Coding
sub property of: CodeSystem.concept.concept.property.value

ValueSet.compose.exclude
type: ObjectProperty
comment: Exclude one or more codes from the value set based on code system filters and/or other value sets.
domain: ValueSetComposeComponent
range: ValueSetComposeComponentInclude
title: Explicitly exclude codes from a code system or other value sets

CapabilityStatementDocumentComponent
type: Class
comment: A document definition.
subclass of: BackboneElement
subclass of: Restriction
  cardinality: 1
  on property: CapabilityStatement.document.profile
  some values from: canonical
subclass of: Restriction
  all values from: markdown
  max cardinality: 1
  on property: CapabilityStatement.document.documentation
subclass of: Restriction
  cardinality: 1
  on property: CapabilityStatement.document.mode
  some values from: code

Contract.term.asset.valuedItem.effectiveTime
type: ObjectProperty
comment: Indicates the time during which this Contract ValuedItem information is effective.
domain: Contract.TermComponent.ContractAssetComponent.ValuedItemComponent
range: dateTime
sub property of: when.done
title: Contract Valued Item Effective Tiem

EpisodeOfCare.statusHistory
type: ObjectProperty
comment: The history of statuses that the EpisodeOfCare has been through (without requiring processing the history of the resource).
domain: EpisodeOfCare
range: EpisodeOfCareStatusHistoryComponent
title: Past list of status codes (the current status may be included to cover the start date of the status)

Provenance.reason
type: ObjectProperty
comment: The reason that the activity was taking place.
domain: Provenance
range: CodeableConcept
sub property of: why
title: Reason the activity is occurring

ValueSetExpansionComponent.ValueSetExpansionContainsComponentContainsDesignation
type: Class
comment: Additional representations for this item - other languages, aliases, specialized purposes, used for particular purposes, etc. These are relevant when the conditions of the expansion do not fix to a single correct representation.
subclass of: BackboneElement
subclass of: Restriction
  cardinality: 1
  on property: ValueSet.expansion.contains.contains.designation.value
  some values from: string
subclass of: Restriction
  all values from: Coding
  max cardinality: 1
  on property: ValueSet.expansion.contains.contains.designation.use
subclass of: Restriction
  all values from: code
  max cardinality: 1
  on property: ValueSet.expansion.contains.contains.designation.language
title: Additional representations for this item

Resource.language
type: ObjectProperty
comment: The base language in which the resource is written.
domain: Resource
range: code
title: Language of the resource content

CarePlan.instantiatesUri
type: ObjectProperty
comment: The URL pointing to an externally maintained protocol, guideline, questionnaire or other definition that is adhered to in whole or in part by this CarePlan.
domain: CarePlan
range: uri
title: Instantiates external protocol or definition

CodeSystem.concept.display
type: ObjectProperty
comment: A human readable string that is the recommended default way to present this concept to a user.
domain: CodeSystem.ConceptDefinitionComponent
range: string
title: Text to display to the user

ActivityDefinition.location
type: ObjectProperty
comment: Identifies the facility where the activity will occur; e.g. home, hospital, specific clinic, etc.
domain: ActivityDefinition
range: Reference
title: Where it should happen

MedicinalProductSpecialDesignationComponent
type: Class
comment: Indicates if the medicinal product has an orphan designation for the treatment of a rare disease.
subclass of: BackboneElement
subclass of: Restriction
  all values from: CodeableConcept
  max cardinality: 1
  on property: MedicinalProduct.specialDesignation.species
subclass of: Restriction
  all values from: CodeableConcept
  max cardinality: 1
  on property: MedicinalProduct.specialDesignation.indication
subclass of: Restriction
  all values from: CodeableConcept
  max cardinality: 1
  on property: MedicinalProduct.specialDesignation.intendedUse
subclass of: Restriction
  all values from: Identifier
  on property: MedicinalProduct.specialDesignation.identifier
subclass of: Restriction
  all values from: dateTime
  max cardinality: 1
  on property: MedicinalProduct.specialDesignation.date
subclass of: Restriction
  all values from: CodeableConcept
  max cardinality: 1
  on property: MedicinalProduct.specialDesignation.status

Contract.term.asset.linkId
type: ObjectProperty
comment: Id [identifier??] of the clause or question text about the asset in the referenced form or QuestionnaireResponse.
domain: Contract.TermComponent.ContractAssetComponent
range: string
title: Pointer to asset text

TestScript.test.action.operation.origin
type: ObjectProperty
comment: The server where the request message originates from. Must be one of the server numbers listed in TestScript.origin section.
domain: TestScriptTestComponent.TestActionComponentOperation
range: integer
title: Server initiating the request

Goal.target.detailQuantity
type: ObjectProperty
domain: GoalTargetComponent
range: Quantity
sub property of: Goal.target.detail

Contract.term.group.asset.valuedItem.entityCodeableConcept
type: ObjectProperty
domain: Contract.TermComponentTerm.ContractAssetComponent.ValuedItemComponent
range: CodeableConcept
sub property of: Contract.term.group.asset.valuedItem.entity

SubstanceReferenceInformation.relationship.interaction
type: ObjectProperty
comment: Todo.
domain: SubstanceReferenceInformationRelationshipComponent
range: CodeableConcept
title: Todo

Contract.term.group.asset.answer.valueQuantity
type: ObjectProperty
domain: Contract.TermComponentTerm.ContractAssetComponentAnswer
range: Quantity
sub property of: Contract.term.group.asset.answer.value

SubstancePolymer.repeat.repeatUnit.structuralRepresentation.type
type: ObjectProperty
comment: Todo.
domain: SubstancePolymerRepeatComponent.SubstancePolymerRepeatRepeatUnitComponent.SubstancePolymerRepeatRepeatUnitStructuralRepresentationComponent
range: CodeableConcept
title: Todo

AdverseEventSuspectEntityComponent
type: Class
comment: Describes the entity that is suspected to have caused the adverse event.
subclass of: BackboneElement
subclass of: Restriction
  all values from: AdverseEventSuspectEntityComponent.AdverseEventSuspectEntityCausalityComponent
  on property: AdverseEvent.suspectEntity.causality
subclass of: Restriction
  cardinality: 1
  on property: AdverseEvent.suspectEntity.instance
  some values from: Reference

ClinicalImpressionInvestigationComponent
type: Class
comment: One or more sets of investigations (signs, symptoms, etc.). The actual grouping of investigations varies greatly depending on the type and context of the assessment. These investigations may include data generated during the assessment process, or data previously generated and recorded that is pertinent to the outcomes.
subclass of: BackboneElement
subclass of: Restriction
  all values from: Reference
  on property: ClinicalImpression.investigation.item
subclass of: Restriction
  cardinality: 1
  on property: ClinicalImpression.investigation.code
  some values from: CodeableConcept

SupplyDelivery.occurrencePeriod
type: ObjectProperty
domain: SupplyDelivery
range: Period
sub property of: SupplyDelivery.occurrence

Provenance.entity.agent.role
type: ObjectProperty
comment: The function of the agent with respect to the activity. The security role enabling the agent with respect to the activity.
domain: ProvenanceEntityComponentAgent
range: CodeableConcept
title: What the agents role was

ImmunizationRecommendation
type: Class
comment: A patient's point-in-time set of recommendations (i.e. forecasting) according to a published schedule with optional supporting justification.
subclass of: clinical.medication
subclass of: DomainResource
subclass of: Restriction
  on property: ImmunizationRecommendation.recommendation
  some values from: ImmunizationRecommendationRecommendationComponent
subclass of: Restriction
  cardinality: 1
  on property: ImmunizationRecommendation.patient
  some values from: Reference
subclass of: Restriction
  cardinality: 1
  on property: ImmunizationRecommendation.date
  some values from: dateTime
subclass of: Restriction
  all values from: Identifier
  on property: ImmunizationRecommendation.identifier
subclass of: Restriction
  all values from: Reference
  max cardinality: 1
  on property: ImmunizationRecommendation.authority

TestScript.test.action.operation.requestHeader
type: ObjectProperty
comment: Header elements would be used to set HTTP headers.
domain: TestScriptTestComponent.TestActionComponentOperation
range: TestScriptTestComponent.TestActionComponentOperation.SetupActionOperationRequestHeaderComponent
title: Each operation can have one or more header elements

Bundle.entry.request.ifNoneMatch
type: ObjectProperty
comment: If the ETag values match, return a 304 Not Modified status. See the API documentation for ["Conditional Read"](http.html#cread).
domain: BundleEntryComponent.BundleEntryRequestComponent
range: string
title: For managing cache currency

NutritionOrder.enteralFormula.routeofAdministration
type: ObjectProperty
comment: The route or physiological path of administration into the patient's gastrointestinal tract for purposes of providing the formula feeding, e.g. nasogastric tube.
domain: NutritionOrderEnteralFormulaComponent
range: CodeableConcept
title: How the formula should enter the patient's gastrointestinal tract

MedicinalProductDeviceSpec.identifier
type: ObjectProperty
comment: Business identifier.
domain: MedicinalProductDeviceSpec
range: Identifier
title: Business identifier

SubstanceMoiety.opticalActivity
type: ObjectProperty
comment: Optical activity shall be captured as described in 4.7.2.
domain: SubstanceMoiety
range: CodeableConcept
title: Optical activity shall be captured as described in 4.7.2

EventDefinition.topic
type: ObjectProperty
comment: Descriptive topics related to the module. Topics provide a high-level categorization of the module that can be useful for filtering and searching.
domain: EventDefinition
range: CodeableConcept
title: E.g. Education, Treatment, Assessment, etc.

Task.status
type: ObjectProperty
comment: The current status of the task.
domain: Task
range: code
sub property of: status
title: draft | requested | received | accepted | +

MedicinalProductDeviceSpec.material.substance
type: ObjectProperty
comment: The substance.
domain: MedicinalProductDeviceSpecMaterialComponent
range: CodeableConcept
title: The substance

Contract.term.action.performerRole
type: ObjectProperty
comment: The type of role or competency of an individual desired or required to perform or not perform the action.
domain: Contract.TermComponent.ActionComponent
range: CodeableConcept
title: Competency of the performer

ExplanationOfBenefit.subType
type: ObjectProperty
comment: A finer grained suite of claim subtype codes which may convey Inpatient vs Outpatient and/or a specialty service. In the US the CMS Bill Type.
domain: ExplanationOfBenefit
range: CodeableConcept
sub property of: class
title: Finer grained claim type information

MedicationKnowledge.monitoringProgram
type: ObjectProperty
comment: The program under which the medication is reviewed.
domain: MedicationKnowledge
range: MedicationKnowledgeMonitoringProgramComponent
title: Program under which a medication is reviewed

SupplyRequest.item
type: ObjectProperty

ClinicalImpression.code
type: ObjectProperty
comment: Categorizes the type of clinical assessment performed.
domain: ClinicalImpression
range: CodeableConcept
sub property of: what
title: Kind of assessment performed

Measure.status
type: ObjectProperty
comment: The status of this measure. Enables tracking the life-cycle of the content.
domain: Measure
range: code
sub property of: status
title: draft | active | retired | unknown

Task.restriction.recipient
type: ObjectProperty
comment: For requests that are targeted to more than on potential recipient/target, for whom is fulfillment sought?
domain: TaskRestrictionComponent
range: Reference
title: For whom is fulfillment sought?

CapabilityStatement.rest.operation.documentation
type: ObjectProperty
comment: Documentation that describes anything special about the operation behavior, possibly detailing different behavior for system, type and instance-level invocation of the operation.
domain: CapabilityStatementRestComponentOperation
range: markdown
title: Specific details about operation behavior

FamilyMemberHistory.deceasedAge
type: ObjectProperty
domain: FamilyMemberHistory
range: Age
sub property of: FamilyMemberHistory.deceased

ClaimResponse.payment.type
type: ObjectProperty
comment: Whether this represents partial or complete payment of the claim.
domain: ClaimResponse.PaymentComponent
range: CodeableConcept
title: Partial or Complete

Appointment.minutesDuration
type: ObjectProperty
comment: Number of minutes that the appointment is to take. This can be less than the duration between the start and end times. For example, where the actual time of appointment is only an estimate or if a 30 minute appointment is being requested, but any time would work. Also, if there is, for example, a planned 15 minute break in the middle of a long appointment, the duration may be 15 minutes less than the difference between the start and end.
domain: Appointment
range: positiveInt
title: Can be less than start/end (e.g. estimate)

Provenance.location
type: ObjectProperty
comment: Where the activity occurred, if relevant.
domain: Provenance
range: Reference
sub property of: where
title: Where the activity occurred, if relevant

Encounter.length
type: ObjectProperty
comment: Quantity of time the encounter lasted. This excludes the time during leaves of absence.
domain: Encounter
range: Duration
title: Quantity of time the encounter lasted (less time absent)

PlanDefinition.action.prefix
type: ObjectProperty
comment: A user-visible prefix for the action.
domain: PlanDefinitionActionComponent
range: string
title: User-visible prefix for the action (e.g. 1. or A.)

RelatedPerson.relationship
type: ObjectProperty
comment: The nature of the relationship between a patient and the related person.
domain: RelatedPerson
range: CodeableConcept
sub property of: class
title: The nature of the relationship

SubstanceSpecification.moiety.name
type: ObjectProperty
comment: Textual name for this moiety substance.
domain: SubstanceSpecificationMoietyComponent
range: string
title: Textual name for this moiety substance

Observation.code
type: ObjectProperty
comment: Describes what was observed. Sometimes this is called the observation "name".
domain: Observation
range: CodeableConcept
sub property of: what
title: Type of observation (code / type)

ExplanationOfBenefit.payee
type: ObjectProperty
comment: The party to be reimbursed for the services.
domain: ExplanationOfBenefit
range: ExplanationOfBenefit.PayeeComponent
title: Party to be paid any benefits payable

ExampleScenario.process.step.alternative.option.step.process.step.operation.receiverActive
type: ObjectProperty
comment: Whether the receiver is deactivated right after the transaction.
domain: ExampleScenarioProcessComponent.ExampleScenarioProcessStepComponent.ExampleScenarioProcessStepAlternativeComponent.ExampleScenarioProcessStepAlternativeOptionComponentStepProcess.ExampleScenarioProcessStepComponent.ExampleScenarioProcessStepOperationComponent
range: boolean
title: Whether the receiver is deactivated right after the transaction

ClinicalImpression.description
type: ObjectProperty
comment: A summary of the context and/or cause of the assessment - why / where was it performed, and what patient events/status prompted it.
domain: ClinicalImpression
range: string
title: Why/how the assessment was performed

MedicationRequest.intent
type: ObjectProperty
comment: Whether the request is a proposal, plan, or an original order.
domain: MedicationRequest
range: code
sub property of: class
title: proposal | plan | order | original-order | instance-order | option

Medication.batch.expirationDate
type: ObjectProperty
comment: When this specific batch of product will expire.
domain: MedicationBatchComponent
range: dateTime
title: When batch will expire

ExampleScenario.process.step.process.step.operation.number
type: ObjectProperty
comment: The sequential number of the interaction, e.g. 1.2.5.
domain: ExampleScenarioProcessComponent.ExampleScenarioProcessStepComponentProcess.ExampleScenarioProcessStepComponent.ExampleScenarioProcessStepOperationComponent
range: string
title: The sequential number of the interaction

Coverage.ClassComponent
type: Class
comment: A suite of underwrite specific classifiers, for example may be used to identify a class of coverage or employer group, Policy, Plan.
subclass of: BackboneElement
subclass of: Restriction
  all values from: string
  max cardinality: 1
  on property: Coverage.class.name
subclass of: Restriction
  cardinality: 1
  on property: Coverage.class.value
  some values from: string
subclass of: Restriction
  cardinality: 1
  on property: Coverage.class.type
  some values from: Coding

PlanDefinition.action.reason
type: ObjectProperty
comment: A description of why this action is necessary or appropriate.
domain: PlanDefinitionActionComponent
range: CodeableConcept
title: Why the action should be performed

ObservationDefinitionQuantitativeDetailsComponent
type: Class
comment: Characteristics for quantitative results of this observation.
subclass of: BackboneElement
subclass of: Restriction
  all values from: integer
  max cardinality: 1
  on property: ObservationDefinition.quantitativeDetails.decimalPrecision
subclass of: Restriction
  all values from: decimal
  max cardinality: 1
  on property: ObservationDefinition.quantitativeDetails.conversionFactor
subclass of: Restriction
  all values from: Coding
  max cardinality: 1
  on property: ObservationDefinition.quantitativeDetails.unit
subclass of: Restriction
  all values from: Coding
  max cardinality: 1
  on property: ObservationDefinition.quantitativeDetails.customaryUnit

SubstanceReferenceInformation.relationship.amount
type: ObjectProperty

CommunicationRequest.sender
type: ObjectProperty
comment: The entity (e.g. person, organization, clinical information system, or device) which is to be the source of the communication.
domain: CommunicationRequest
range: Reference
sub property of: who.actor
title: Message sender

ImagingStudy.series.instance.identifier
type: ObjectProperty
comment: Formal identifier for this image or other content.
domain: ImagingStudySeriesComponent.ImagingStudySeriesInstanceComponent
range: Identifier
title: Formal DICOM identifier for this instance

MedicinalProductPharmaceutical.administrableDoseForm
type: ObjectProperty
comment: The administrable dose form, after necessary reconstitution.
domain: MedicinalProductPharmaceutical
range: CodeableConcept
title: The administrable dose form, after necessary reconstitution

ClaimResponse.item.adjudication
type: ObjectProperty
comment: The adjudication results.
domain: ClaimResponse.ItemComponent
range: ClaimResponse.ItemComponent.AdjudicationComponent
title: Adjudication details

MedicationKnowledge.regulatory.maxDispense.period
type: ObjectProperty
comment: The period that applies to the maximum number of units.
domain: MedicationKnowledgeRegulatoryComponent.MedicationKnowledgeRegulatoryMaxDispenseComponent
range: Duration
title: The period that applies to the maximum number of units

ValueSetExpansionComponent.ValueSetExpansionContainsComponentContains
type: Class
comment: Other codes and entries contained under this entry in the hierarchy.
subclass of: BackboneElement
subclass of: Restriction
  all values from: string
  max cardinality: 1
  on property: ValueSet.expansion.contains.contains.display
subclass of: Restriction
  all values from: uri
  max cardinality: 1
  on property: ValueSet.expansion.contains.contains.system
subclass of: Restriction
  all values from: boolean
  max cardinality: 1
  on property: ValueSet.expansion.contains.contains.inactive
subclass of: Restriction
  all values from: ValueSetExpansionComponent.ValueSetExpansionContainsComponentContainsContains
  on property: ValueSet.expansion.contains.contains.contains
subclass of: Restriction
  all values from: code
  max cardinality: 1
  on property: ValueSet.expansion.contains.contains.code
subclass of: Restriction
  all values from: ValueSetExpansionComponent.ValueSetExpansionContainsComponentContainsDesignation
  on property: ValueSet.expansion.contains.contains.designation
subclass of: Restriction
  all values from: boolean
  max cardinality: 1
  on property: ValueSet.expansion.contains.contains.abstract
subclass of: Restriction
  all values from: string
  max cardinality: 1
  on property: ValueSet.expansion.contains.contains.version
title: Codes contained under this entry

Contract.alias
type: ObjectProperty
comment: Alternative representation of the title for this Contract definition, derivative, or instance in any legal state., e.g., a domain specific contract number related to legislation.
domain: Contract
range: string
title: Acronym or short name

MedicinalProductClinicals.therapeuticIndication.population.ageRange
type: ObjectProperty
domain: MedicinalProductClinicalsTherapeuticIndicationComponentPopulation
range: Range
sub property of: MedicinalProductClinicals.therapeuticIndication.population.age

MedicinalProduct.name.countryLanguage.jurisdiction
type: ObjectProperty
comment: Jurisdiction code for where this name applies.
domain: MedicinalProductNameComponent.MedicinalProductNameCountryLanguageComponent
range: CodeableConcept
title: Jurisdiction code for where this name applies

DataRequirement.sort
type: ObjectProperty
comment: Specifies the order of the results to be returned.
domain: DataRequirement
range: DataRequirementSortComponent
title: Order of the results

Procedure.basedOn
type: ObjectProperty
comment: A reference to a resource that contains details of the request for this procedure.
domain: Procedure
range: Reference
title: A request for this procedure

CompartmentDefinition.resource.documentation
type: ObjectProperty
comment: Additional documentation about the resource and compartment.
domain: CompartmentDefinitionResourceComponent
range: string
title: Additional documentation about the resource and compartment

ExplanationOfBenefit.SupportingInformationComponent
type: Class
comment: Additional information codes regarding exceptions, special considerations, the condition, situation, prior or concurrent issues. Often there are mutiple jurisdiction specific valuesets which are required.
subclass of: BackboneElement
subclass of:
  union of: Restriction
    all values from: boolean
    max cardinality: 1
    on property: ExplanationOfBenefit.information.valueBoolean
  union of: Restriction
    all values from: string
    max cardinality: 1
    on property: ExplanationOfBenefit.information.valueString
  union of: Restriction
    all values from: Quantity
    max cardinality: 1
    on property: ExplanationOfBenefit.information.valueQuantity
  union of: Restriction
    all values from: Attachment
    max cardinality: 1
    on property: ExplanationOfBenefit.information.valueAttachment
  union of: Restriction
    all values from: Reference
    max cardinality: 1
    on property: ExplanationOfBenefit.information.valueReference
subclass of: Restriction
  cardinality: 1
  on property: ExplanationOfBenefit.information.sequence
  some values from: positiveInt
subclass of: Restriction
  all values from: Coding
  max cardinality: 1
  on property: ExplanationOfBenefit.information.reason
subclass of: Restriction
  cardinality: 1
  on property: ExplanationOfBenefit.information.category
  some values from: CodeableConcept
subclass of: Restriction
  all values from: CodeableConcept
  max cardinality: 1
  on property: ExplanationOfBenefit.information.code
subclass of:
  union of: Restriction
    all values from: date
    max cardinality: 1
    on property: ExplanationOfBenefit.information.timingDate
  union of: Restriction
    all values from: Period
    max cardinality: 1
    on property: ExplanationOfBenefit.information.timingPeriod

MedicinalProductClinicals.contraindication.therapeuticIndication.population
type: ObjectProperty
comment: The population group to which this applies.
domain: MedicinalProductClinicalsContraindicationComponentTherapeuticIndication
range: MedicinalProductClinicalsContraindicationComponentTherapeuticIndicationPopulation
title: The population group to which this applies

Condition.category
type: ObjectProperty
comment: A category assigned to the condition.
domain: Condition
range: CodeableConcept
sub property of: class
title: problem-list-item | encounter-diagnosis

AdverseEvent.study
type: ObjectProperty
comment: AdverseEvent.study.
domain: AdverseEvent
range: Reference

Claim.careTeam.responsible
type: ObjectProperty
comment: The party who is billing and responsible for the claimed good or service rendered to the patient.
domain: Claim.CareTeamComponent
range: boolean
title: Billing provider

DeviceUseStatement.identifier
type: ObjectProperty
comment: An external identifier for this statement such as an IRI.
domain: DeviceUseStatement
range: Identifier
sub property of: id
title: External identifier for this record

DiagnosticReportMediaComponent
type: Class
comment: A list of key images associated with this report. The images are generally created during the diagnostic process, and may be directly of the patient, or of treated specimens (i.e. slides of interest).
subclass of: BackboneElement
subclass of: Restriction
  cardinality: 1
  on property: DiagnosticReport.media.link
  some values from: Reference
subclass of: Restriction
  all values from: string
  max cardinality: 1
  on property: DiagnosticReport.media.comment

ProdCharacteristic.height
type: ObjectProperty
comment: Where applicable, the height can be specified using a numerical value and its unit of measurement The unit of measurement shall be specified in accordance with ISO 11240 and the resulting terminology The symbol and the symbol identifier shall be used.
domain: ProdCharacteristic
range: Quantity
title: Where applicable, the height can be specified using a numerical value and its unit of measurement The unit of measurement shall be specified in accordance with ISO 11240 and the resulting terminology The symbol and the symbol identifier shall be used

MedicationKnowledge.administrationGuidelines.patientCharacteristics
type: ObjectProperty
comment: Characteristics of the patient that are relevant to the administration guidelines (for example, height, weight,gender, etc).
domain: MedicationKnowledgeAdministrationGuidelinesComponent
range: MedicationKnowledgeAdministrationGuidelinesComponent.MedicationKnowledgeAdministrationGuidelinesPatientCharacteristicsComponent
title: Characteristics of the patient that are relevant to the administration guidelines

Contract.term.group.asset.answer.valueUri
type: ObjectProperty
domain: Contract.TermComponentTerm.ContractAssetComponentAnswer
range: uri
sub property of: Contract.term.group.asset.answer.value

ImagingStudy.series.identifier
type: ObjectProperty
comment: Formal identifier for this series.
domain: ImagingStudySeriesComponent
range: Identifier
title: Formal DICOM identifier for this series

SequenceQualityComponent
type: Class
comment: An experimental feature attribute that defines the quality of the feature in a quantitative way, such as a phred quality score ([SO:0001686](http://www.sequenceontology.org/browser/current_svn/term/SO:0001686)).
subclass of: BackboneElement
subclass of: Restriction
  all values from: Quantity
  max cardinality: 1
  on property: Sequence.quality.score
subclass of: Restriction
  all values from: SequenceQualityComponent.SequenceQualityRocComponent
  max cardinality: 1
  on property: Sequence.quality.roc
subclass of: Restriction
  all values from: decimal
  max cardinality: 1
  on property: Sequence.quality.fScore
subclass of: Restriction
  all values from: decimal
  max cardinality: 1
  on property: Sequence.quality.queryTP
subclass of: Restriction
  all values from: decimal
  max cardinality: 1
  on property: Sequence.quality.truthTP
subclass of: Restriction
  all values from: CodeableConcept
  max cardinality: 1
  on property: Sequence.quality.standardSequence
subclass of: Restriction
  all values from: decimal
  max cardinality: 1
  on property: Sequence.quality.recall
subclass of: Restriction
  all values from: decimal
  max cardinality: 1
  on property: Sequence.quality.queryFP
subclass of: Restriction
  cardinality: 1
  on property: Sequence.quality.type
  some values from: code
subclass of: Restriction
  all values from: integer
  max cardinality: 1
  on property: Sequence.quality.end
subclass of: Restriction
  all values from: decimal
  max cardinality: 1
  on property: Sequence.quality.truthFN
subclass of: Restriction
  all values from: decimal
  max cardinality: 1
  on property: Sequence.quality.precision
subclass of: Restriction
  all values from: integer
  max cardinality: 1
  on property: Sequence.quality.start
subclass of: Restriction
  all values from: decimal
  max cardinality: 1
  on property: Sequence.quality.gtFP
subclass of: Restriction
  all values from: CodeableConcept
  max cardinality: 1
  on property: Sequence.quality.method

SpecimenDefinition.specimenToLab.handling.conditionSet
type: ObjectProperty
comment: Code representing the set of handling instructions.
domain: SpecimenDefinitionSpecimenToLabComponent.SpecimenDefinitionSpecimenToLabHandlingComponent
range: CodeableConcept
title: Conservation condition set

Timing.repeat.timeOfDay
type: ObjectProperty
comment: Specified time of day for action to take place.
domain: TimingRepeatComponent
range: time
title: Time of day for action

QuestionnaireResponse.item.item.answer.valueReference
type: ObjectProperty
domain: QuestionnaireResponseItemComponentItem.QuestionnaireResponseItemAnswerComponent
range: Reference
sub property of: QuestionnaireResponse.item.item.answer.value

Invoice.date
type: ObjectProperty
comment: Date/time(s) of when this Invoice was posted.
domain: Invoice
range: dateTime
sub property of: when.done
title: Invoice date / posting date

NutritionOrder.excludeFoodModifier
type: ObjectProperty
comment: This modifier is used to convey Order-specific modifier about the type of oral food or oral fluids that should not be given. These can be derived from patient allergies, intolerances, or preferences such as No Red Meat, No Soy or No Wheat or Gluten-Free. While it should not be necessary to repeat allergy or intolerance information captured in the referenced AllergyIntolerance resource in the excludeFoodModifier, this element may be used to convey additional specificity related to foods that should be eliminated from the patient’s diet for any reason. This modifier applies to the entire nutrition order inclusive of the oral diet, nutritional supplements and enteral formula feedings.
domain: NutritionOrder
range: CodeableConcept
title: Order-specific modifier about the type of food that should not be given

ConceptMap.publisher
type: ObjectProperty
comment: The name of the organization or individual that published the concept map.
domain: ConceptMap
range: string
sub property of: who.witness
title: Name of the publisher (organization or individual)

TerminologyCapabilitiesImplementationComponent
type: Class
comment: Identifies a specific implementation instance that is described by the terminology capability statement - i.e. a particular installation, rather than the capabilities of a software program.
subclass of: BackboneElement
subclass of: Restriction
  all values from: url
  max cardinality: 1
  on property: TerminologyCapabilities.implementation.url
subclass of: Restriction
  cardinality: 1
  on property: TerminologyCapabilities.implementation.description
  some values from: string

ValueSet.compose.include.concept
type: ObjectProperty
comment: Specifies a concept to be included or excluded.
domain: ValueSetComposeComponent.ConceptSetComponent
range: ValueSetComposeComponent.ConceptSetComponent.ConceptReferenceComponent
title: A concept defined in the system

Immunization.lotNumber
type: ObjectProperty
comment: Lot number of the vaccine product.
domain: Immunization
range: string
title: Vaccine lot number

Claim.information.reason
type: ObjectProperty
comment: For example, provides the reason for: the additional stay, or missing tooth or any other situation where a reason code is required in addition to the content.
domain: Claim.SpecialConditionComponent
range: CodeableConcept
title: Reason associated with the information

Coverage.identifier
type: ObjectProperty
comment: The main (and possibly only) identifier for the coverage - often referred to as a Member Id, Certificate number, Personal Health Number or Case ID. May be constructed as the concatenation of the Coverage.SubscriberID and the Coverage.dependant.
domain: Coverage
range: Identifier
sub property of: id
title: The primary coverage ID

ValueSetComposeComponentInclude.ConceptSetFilterComponent
type: Class
comment: Select concepts by specify a matching criteria based on the properties (including relationships) defined by the system. If multiple filters are specified, they SHALL all be true.
subclass of: BackboneElement
subclass of: Restriction
  cardinality: 1
  on property: ValueSet.compose.exclude.filter.value
  some values from: string
subclass of: Restriction
  cardinality: 1
  on property: ValueSet.compose.exclude.filter.op
  some values from: code
subclass of: Restriction
  cardinality: 1
  on property: ValueSet.compose.exclude.filter.property
  some values from: code

Questionnaire.item.item.enableWhen.answerInteger
type: ObjectProperty
domain: QuestionnaireItemComponentItem.QuestionnaireItemEnableWhenComponent
range: integer
sub property of: Questionnaire.item.item.enableWhen.answer

Observation.interpretation
type: ObjectProperty
comment: A categorical assessment of an observation value. For example, high, low, normal.
domain: Observation
range: CodeableConcept
title: High, low, normal, etc.

Consent.provision.provision.period
type: ObjectProperty
comment: The timeframe in this rule is valid.
domain: Consent.provisionComponentProvision
range: Period
title: Timeframe for this rule

SubstanceSpecification.substanceName.officialName.date
type: ObjectProperty
comment: Date of official name change.
domain: SubstanceSpecificationSubstanceNameComponent.SubstanceSpecificationSubstanceNameOfficialNameComponent
range: dateTime
title: Date of official name change

Contract.term.securityLabel
type: ObjectProperty
comment: Security labels that protect the handling of information about the term and its elements, which may be specifically identified..
domain: Contract.TermComponent
range: Contract.TermComponent.SecurityLabelComponent
title: Protection for the Term

Basic.identifier
type: ObjectProperty
comment: Identifier assigned to the resource for business purposes, outside the context of FHIR.
domain: Basic
range: Identifier
sub property of: id
title: Business identifier

RequestGroup.action.code
type: ObjectProperty
comment: A code that provides meaning for the action or action group. For example, a section may have a LOINC code for a the section of a documentation template.
domain: RequestGroupActionComponent
range: CodeableConcept
title: Code representing the meaning of the action or sub-actions

DeviceRequest.codeCodeableConcept
type: ObjectProperty
domain: DeviceRequest
range: CodeableConcept
sub property of: DeviceRequest.code

StructureDefinition.identifier
type: ObjectProperty
comment: A formal identifier that is used to identify this structure definition when it is represented in other formats, or referenced in a specification, model, design or an instance.
domain: StructureDefinition
range: Identifier
sub property of: id
title: Additional identifier for the structure definition

OperationDefinition.parameter.part.max
type: ObjectProperty
comment: The maximum number of times this element is permitted to appear in the request or response.
domain: OperationDefinitionParameterComponentParameter
range: string
title: Maximum Cardinality (a number or *)

OperationDefinition.jurisdiction
type: ObjectProperty
comment: A legal or geographic region in which the operation definition is intended to be used.
domain: OperationDefinition
range: CodeableConcept
title: Intended jurisdiction for operation definition (if applicable)

Endpoint.identifier
type: ObjectProperty
comment: Identifier for the organization that is used to identify the endpoint across multiple disparate systems.
domain: Endpoint
range: Identifier
sub property of: id
title: Identifies this endpoint across multiple systems

ExampleScenario.process.step.process.step.alternative.option.step.pause
type: ObjectProperty
comment: If there is a pause in the flow.
domain: ExampleScenarioProcessComponent.ExampleScenarioProcessStepComponentProcess.ExampleScenarioProcessStepComponent.ExampleScenarioProcessStepAlternativeComponent.ExampleScenarioProcessStepAlternativeOptionComponentStep
range: boolean
title: If there is a pause in the flow

EntryDefinition.additionalClassification
type: ObjectProperty
comment: User for example for ATC classification, or.
domain: EntryDefinition
range: CodeableConcept
title: Additional classification of the catalog entry

Questionnaire.item.item.code
type: ObjectProperty
comment: A terminology code that corresponds to this group or question (e.g. a code from LOINC, which defines many questions and answers).
domain: QuestionnaireItemComponentItem
range: Coding
title: Corresponding concept for this item in a terminology

ExplanationOfBenefit.payment.type
type: ObjectProperty
comment: Whether this represents partial or complete payment of the claim.
domain: ExplanationOfBenefit.PaymentComponent
range: CodeableConcept
title: Partial or Complete

DeviceVersionComponent
type: Class
comment: The actual design of the device or software version running on the device.
subclass of: BackboneElement
subclass of: Restriction
  cardinality: 1
  on property: Device.version.value
  some values from: string
subclass of: Restriction
  all values from: Identifier
  max cardinality: 1
  on property: Device.version.component
subclass of: Restriction
  all values from: CodeableConcept
  max cardinality: 1
  on property: Device.version.type

Observation.component.referenceRange.low
type: ObjectProperty
comment: The value of the low bound of the reference range. The low bound of the reference range endpoint is inclusive of the value (e.g. reference range is >=5 - <=9). If the low bound is omitted, it is assumed to be meaningless (e.g. reference range is <=2.3).
domain: ObservationComponentComponentReferenceRange
range: SimpleQuantity
title: Low Range, if relevant

Questionnaire.derivedFrom
type: ObjectProperty
comment: The URL of a Questionnaire that this Questionnaire is based on.
domain: Questionnaire
range: canonical
title: Instantiates protocol or definition

TaskRestrictionComponent
type: Class
comment: If the Task.focus is a request resource and the task is seeking fulfillment (i.e. is asking for the request to be actioned), this element identifies any limitations on what parts of the referenced request should be actioned.
subclass of: BackboneElement
subclass of: Restriction
  all values from: Reference
  on property: Task.restriction.recipient
subclass of: Restriction
  all values from: Period
  max cardinality: 1
  on property: Task.restriction.period
subclass of: Restriction
  all values from: positiveInt
  max cardinality: 1
  on property: Task.restriction.repetitions

FHIR Model Ontology
type: Ontology
comment: Formal model of FHIR Clinical Resources
imports: w5.ttl
version IRI: fhir.ttl

SubstanceSpecification.substanceName.officialName.authority
type: ObjectProperty
comment: Which authority uses this official name.
domain: SubstanceSpecificationSubstanceNameComponent.SubstanceSpecificationSubstanceNameOfficialNameComponent
range: CodeableConcept
title: Which authority uses this official name

TestScript.setup.action.operation.encodeRequestUrl
type: ObjectProperty
comment: Whether or not to implicitly send the request url in encoded format. The default is true to match the standard RESTful client behavior. Set to false when communicating with a server that does not support encoded url paths.
domain: TestScriptSetupComponent.SetupActionComponent.SetupActionOperationComponent
range: boolean
title: Whether or not to send the request url in encoded format

ElementDefinition.representation
type: ObjectProperty
comment: Codes that define how this element is represented in instances, when the deviation varies from the normal case.
domain: ElementDefinition
range: code
title: xmlAttr | xmlText | typeAttr | cdaText | xhtml

DeviceRequest.authoredOn
type: ObjectProperty
comment: When the request transitioned to being actionable.
domain: DeviceRequest
range: dateTime
sub property of: when.recorded
title: When recorded

ConceptMap.group.element.target.product
type: ObjectProperty
comment: A set of additional outcomes from this mapping to other elements. To properly execute this mapping, the specified element must be mapped to some data element or source that is in context. The mapping may still be useful without a place for the additional data elements, but the equivalence cannot be relied on.
domain: ConceptMapGroupComponent.SourceElementComponent.TargetElementComponent
range: ConceptMapGroupComponent.SourceElementComponent.TargetElementComponentDependsOn
title: Other concepts that this mapping also produces

PlanDefinition.author
type: ObjectProperty
comment: An individiual or organization primarily involved in the creation and maintenance of the content.
domain: PlanDefinition
range: ContactDetail
title: Who authored the content

Practitioner.communication
type: ObjectProperty
comment: A language the practitioner can use in patient communication.
domain: Practitioner
range: CodeableConcept
title: A language the practitioner can use in patient communication

Resource.implicitRules
type: ObjectProperty
comment: A reference to a set of rules that were followed when the resource was constructed, and which must be understood when processing the content. Often, this is a reference to an implementation guide that defines the special rules along with other profiles etc.
domain: Resource
range: uri
title: A set of rules under which this content was created

DeviceRequest.performerType
type: ObjectProperty
comment: Desired type of performer for doing the diagnostic testing.
domain: DeviceRequest
range: CodeableConcept
sub property of: who.actor
title: Filler role

Flag.author
type: ObjectProperty
comment: The person, organization or device that created the flag.
domain: Flag
range: Reference
sub property of: who.author
title: Flag creator

Contract.term.group.asset.subtype
type: ObjectProperty
comment: May be a subtype or part of an offered asset.
domain: Contract.TermComponentTerm.ContractAssetComponent
range: CodeableConcept
title: Asset sub-category

MedicationRequest.requester
type: ObjectProperty
comment: The individual, organization, or device that initiated the request and has responsibility for its activation.
domain: MedicationRequest
range: Reference
sub property of: who.author
title: Who/What requested the Request

ActivityDefinition.identifier
type: ObjectProperty
comment: A formal identifier that is used to identify this activity definition when it is represented in other formats, or referenced in a specification, model, design or an instance.
domain: ActivityDefinition
range: Identifier
sub property of: id
title: Additional identifier for the activity definition

TestReport.status
type: ObjectProperty
comment: The current state of this test report.
domain: TestReport
range: code
sub property of: status
title: completed | in-progress | waiting | stopped | entered-in-error

HumanName.suffix
type: ObjectProperty
comment: Part of the name that is acquired as a title due to academic, legal, employment or nobility status, etc. and that appears at the end of the name.
domain: HumanName
range: string
title: Parts that come after the name

MeasureReportGroupComponent.MeasureReportGroupStratifierComponent.StratifierGroupComponent
type: Class
comment: This element contains the results for a single stratum within the stratifier. For example, when stratifying on administrative gender, there will be four strata, one for each possible gender value.
subclass of: BackboneElement
subclass of: Restriction
  all values from: Quantity
  max cardinality: 1
  on property: MeasureReport.group.stratifier.stratum.measureScore
subclass of: Restriction
  all values from: MeasureReportGroupComponent.MeasureReportGroupStratifierComponent.StratifierGroupComponent.StratifierGroupPopulationComponent
  on property: MeasureReport.group.stratifier.stratum.population
subclass of: Restriction
  cardinality: 1
  on property: MeasureReport.group.stratifier.stratum.value
  some values from: CodeableConcept

ImmunizationRecommendation.recommendation.dateCriterion
type: ObjectProperty
comment: Vaccine date recommendations. For example, earliest date to administer, latest date to administer, etc.
domain: ImmunizationRecommendationRecommendationComponent
range: ImmunizationRecommendationRecommendationComponent.ImmunizationRecommendationRecommendationDateCriterionComponent
title: Dates governing proposed immunization

OperationDefinition.parameter.part.part
type: ObjectProperty
comment: The parts of a nested Parameter.
domain: OperationDefinitionParameterComponentParameter
range: OperationDefinitionParameterComponentParameterParameter
title: Parts of a nested Parameter

OperationDefinition.parameter.part.documentation
type: ObjectProperty
comment: Describes the meaning or use of this parameter.
domain: OperationDefinitionParameterComponentParameter
range: string
title: Description of meaning/use

Contract.term.offer
type: ObjectProperty
comment: The matter of concern in the context of this provision of the agrement.
domain: Contract.TermComponent
range: Contract.TermComponent.ContractOfferComponent
title: Context of the Contract term

ChargeItemDefinition.title
type: ObjectProperty
comment: A short, descriptive, user-friendly title for the charge item definition.
domain: ChargeItemDefinition
range: string
title: Name for this charge item definition (human friendly)

Dosage.doseAndRate.rateRange
type: ObjectProperty
domain: DosageDoseAndRateComponent
range: Range
sub property of: Dosage.doseAndRate.rate

ServiceRequest.locationReference
type: ObjectProperty
comment: A reference to the the preferred location(s) where the procedure should actually happen. E.g. at home or nursing day care center.
domain: ServiceRequest
range: Reference
sub property of: who.actor
title: Requested location

ProcessResponse.request
type: ObjectProperty
comment: Original request resource reference.
domain: ProcessResponse
range: Reference
sub property of: why
title: Request reference

MedicinalProduct.specialDesignation.status
type: ObjectProperty
comment: For example granted, pending, expired or withdrawn.
domain: MedicinalProductSpecialDesignationComponent
range: CodeableConcept
title: For example granted, pending, expired or withdrawn

RequestGroup.action.textEquivalent
type: ObjectProperty
comment: A text equivalent of the action to be performed. This provides a human-interpretable description of the action when the definition is consumed by a system that might not be capable of interpreting it dynamically.
domain: RequestGroupActionComponent
range: string
title: Static text equivalent of the action, used if the dynamic aspects cannot be interpreted by the receiving system

CodeSystem.concept.property.valueCoding
type: ObjectProperty
domain: CodeSystem.ConceptDefinitionComponent.ConceptPropertyComponent
range: Coding
sub property of: CodeSystem.concept.property.value

ImplementationGuideDefinitionComponent.ImplementationGuideDefinitionResourceComponent
type: Class
comment: A resource that is part of the implementation guide. Conformance resources (value set, structure definition, capability statements etc.) are obvious candidates for inclusion, but any kind of resource can be included as an example resource.
subclass of: BackboneElement
subclass of: Restriction
  all values from: id
  max cardinality: 1
  on property: ImplementationGuide.definition.resource.package
subclass of:
  union of: Restriction
    all values from: boolean
    max cardinality: 1
    on property: ImplementationGuide.definition.resource.exampleBoolean
  union of: Restriction
    all values from: canonical
    max cardinality: 1
    on property: ImplementationGuide.definition.resource.exampleCanonical
subclass of: Restriction
  all values from: string
  max cardinality: 1
  on property: ImplementationGuide.definition.resource.description
subclass of: Restriction
  all values from: string
  max cardinality: 1
  on property: ImplementationGuide.definition.resource.name
subclass of: Restriction
  cardinality: 1
  on property: ImplementationGuide.definition.resource.reference
  some values from: Reference

RequestGroup.action.action.condition.language
type: ObjectProperty
comment: The media type of the language for the expression.
domain: RequestGroupActionComponentAction.RequestGroupActionConditionComponent
range: string
title: Language of the expression

DataRequirement.sort.path
type: ObjectProperty
comment: The attribute of the sort. The specified path must be resolvable from the type of the required data. The path is allowed to contain qualifiers (.) to traverse sub-elements, as well as indexers ([x]) to traverse multiple-cardinality sub-elements. Note that the index must be an integer constant.
domain: DataRequirementSortComponent
range: string
title: The name of the attribute to perform the sort

SearchParameter.component
type: ObjectProperty
comment: Used to define the parts of a composite search parameter.
domain: SearchParameter
range: SearchParameterComponentComponent
title: For Composite resources to define the parts

ParametersParameterComponentParameter
type: Class
comment: A named part of a multi-part parameter.
subclass of: BackboneElement
subclass of: Restriction
  all values from: ParametersParameterComponentParameterParameter
  on property: Parameters.parameter.part.part
subclass of: Restriction
  all values from: Resource
  max cardinality: 1
  on property: Parameters.parameter.part.resource
subclass of: Restriction
  all values from: Element
  max cardinality: 1
  on property: Parameters.parameter.part.value
subclass of: Restriction
  cardinality: 1
  on property: Parameters.parameter.part.name
  some values from: string
title: Named part of a multi-part parameter

Invoice.participant.actor
type: ObjectProperty
comment: The device, practitioner, etc. who performed or participated in the service.
domain: InvoiceParticipantComponent
range: Reference
sub property of: who.actor
title: Individual who was involved

Specimen.collection.collectedDateTime
type: ObjectProperty
domain: SpecimenCollectionComponent
range: dateTime
sub property of: Specimen.collection.collected

SearchParameter.url
type: ObjectProperty
comment: An absolute URI that is used to identify this search parameter when it is referenced in a specification, model, design or an instance; also called its canonical identifier. This SHOULD be globally unique and SHOULD be a literal address at which at which an authoritative instance of this search parameter is (or will be) published. This URL can be the target of a canonical reference. It SHALL remain the same when the search parameter is stored on different servers.
domain: SearchParameter
range: uri
sub property of: id
title: Canonical identifier for this search parameter, represented as a URI (globally unique)

HumanName
type: Class
comment: A human's name with the ability to identify parts and usage.
subclass of: Element
subclass of: Restriction
  all values from: string
  max cardinality: 1
  on property: HumanName.family
subclass of: Restriction
  all values from: string
  on property: HumanName.suffix
subclass of: Restriction
  all values from: string
  on property: HumanName.prefix
subclass of: Restriction
  all values from: Period
  max cardinality: 1
  on property: HumanName.period
subclass of: Restriction
  all values from: string
  max cardinality: 1
  on property: HumanName.text
subclass of: Restriction
  all values from: code
  max cardinality: 1
  on property: HumanName.use
subclass of: Restriction
  all values from: string
  on property: HumanName.given
title: Name of a human - parts and usage

InsurancePlan.plan.type
type: ObjectProperty
comment: Type of plan. For example, "Platinum" or "High Deductable".
domain: InsurancePlanPlanComponent
range: CodeableConcept
title: Type of plan

Money.currency
type: ObjectProperty
comment: ISO 4217 Currency Code.
domain: Money
range: code
title: ISO 4217 Currency Code

Procedure.reasonReference
type: ObjectProperty
comment: The justification of why the procedure was performed.
domain: Procedure
range: Reference
sub property of: why
title: The justification that the procedure was performed

Contract.TermComponent.ContractOfferComponent.ContractPartyComponent
type: Class
comment: Offer Recipient.
subclass of: BackboneElement
subclass of: Restriction
  cardinality: 1
  on property: Contract.term.offer.party.role
  some values from: CodeableConcept
subclass of: Restriction
  on property: Contract.term.offer.party.reference
  some values from: Reference

Procedure.statusReason
type: ObjectProperty
comment: Captures the reason for the current state of the procedure.
domain: Procedure
range: CodeableConcept
title: Reason for current status

ExplanationOfBenefit.form
type: ObjectProperty
comment: The form to be used for printing the content.
domain: ExplanationOfBenefit
range: CodeableConcept
title: Printed Form Identifier

ObservationDefinition.code
type: ObjectProperty
comment: Describes what will be observed. Sometimes this is called the observation "name".
domain: ObservationDefinition
range: Coding
sub property of: what
title: Type of observation (code / type)

MedicationKnowledge.regulatory.schedule
type: ObjectProperty
comment: Specifies the schedule of a medication in jurisdiction.
domain: MedicationKnowledgeRegulatoryComponent
range: MedicationKnowledgeRegulatoryComponent.MedicationKnowledgeRegulatoryScheduleComponent
title: Specifies the schedule of a medication in jurisdiction

AllergyIntolerance.reaction.onset
type: ObjectProperty
comment: Record of the date and/or time of the onset of the Reaction.
domain: AllergyIntoleranceReactionComponent
range: dateTime
title: Date(/time) when manifestations showed

EventDefinition.lastReviewDate
type: ObjectProperty
comment: The date on which the resource content was last reviewed. Review happens periodically after approval but does not change the original approval date.
domain: EventDefinition
range: date
title: When the event definition was last reviewed

SpecimenDefinition.specimenToLab.containerDescription
type: ObjectProperty
comment: The textual description of the kind of container.
domain: SpecimenDefinitionSpecimenToLabComponent
range: string
title: Container description

CapabilityStatement.rest.resource.referencePolicy
type: ObjectProperty
comment: A set of flags that defines how references are supported.
domain: CapabilityStatementRestComponent.CapabilityStatementRestResourceComponent
range: code
title: literal | logical | resolves | enforced | local

Questionnaire.item.item.enableWhen.answerQuantity
type: ObjectProperty
domain: QuestionnaireItemComponentItem.QuestionnaireItemEnableWhenComponent
range: Quantity
sub property of: Questionnaire.item.item.enableWhen.answer

ImagingStudy.reasonReference
type: ObjectProperty
comment: Indicates another resource whose existence justifies this Study.
domain: ImagingStudy
range: Reference
sub property of: why
title: Why was study performed

AllergyIntolerance.reaction.note
type: ObjectProperty
comment: Additional text about the adverse reaction event not captured in other fields.
domain: AllergyIntoleranceReactionComponent
range: Annotation
title: Text about event not captured in other fields

What happens in each alternative option
type: Class
comment: What happens in each alternative option.
label: ExampleScenarioProcessComponent.ExampleScenarioProcessStepComponent.ExampleScenarioProcessStepAlternativeComponent.ExampleScenarioProcessStepAlternativeOptionComponentStep.ExampleScenarioProcessStepAlternativeComponent.ExampleScenarioProcessStepAlternativeOptionComponentStep
subclass of: BackboneElement

OrganizationAffiliation.endpoint
type: ObjectProperty
comment: Technical endpoints providing access to services operated for this role.
domain: OrganizationAffiliation
range: Reference
title: Technical endpoints providing access to services operated for this role

ChargeItem.product
type: ObjectProperty

HumanName.use
type: ObjectProperty
comment: Identifies the purpose for this name.
domain: HumanName
range: code
title: usual | official | temp | nickname | anonymous | old | maiden

ExampleScenario.instance.version.description
type: ObjectProperty
comment: The description of the resource version.
domain: ExampleScenarioInstanceComponent.ExampleScenarioInstanceVersionComponent
range: markdown
title: The description of the resource version

StructureDefinition.contextInvariant
type: ObjectProperty
comment: A set of rules as FHIRPath Invariants about when the extension can be used (e.g. co-occurrence variants for the extension). All the rules must be true.
domain: StructureDefinition
range: string
title: FHIRPath invariants - when the extension can be used

ImplementationGuide.definition.parameter.value
type: ObjectProperty
comment: Value for named type.
domain: ImplementationGuideDefinitionComponent.ImplementationGuideDefinitionParameterComponent
range: string
title: Value for named type

Contract.term.group.offer.answer.valueUri
type: ObjectProperty
domain: Contract.TermComponentTerm.ContractOfferComponent.AnswerComponent
range: uri
sub property of: Contract.term.group.offer.answer.value

Questionnaire.useContext
type: ObjectProperty
comment: The content was developed with a focus and intent of supporting the contexts that are listed. These terms may be used to assist with indexing and searching for appropriate questionnaire instances.
domain: Questionnaire
range: UsageContext
title: The context that the content is intended to support

ExplanationOfBenefit.item.detail.programCode
type: ObjectProperty
comment: For programs which require reson codes for the inclusion, covering, of this billed item under the program or sub-program.
domain: ExplanationOfBenefit.ItemComponent.DetailComponent
range: CodeableConcept
title: Program specific reason for item inclusion

DiagnosticReport.media.link
type: ObjectProperty
comment: Reference to the image source.
domain: DiagnosticReportMediaComponent
range: Reference
title: Reference to the image source

ImplementationGuide.definition.page.generation
type: ObjectProperty
comment: A code that indicates how the page is generated.
domain: ImplementationGuideDefinitionComponent.ImplementationGuideDefinitionPageComponent
range: code
title: html | markdown | xml | generated

MedicinalProductAuthorization.procedure.dateDateTime
type: ObjectProperty
domain: MedicinalProductAuthorizationProcedureComponent
range: dateTime
sub property of: MedicinalProductAuthorization.procedure.date

Claim.type
type: ObjectProperty
comment: The category of claim, e.g. oral, pharmacy, vision, institutional, professional.
domain: Claim
range: CodeableConcept
sub property of: class
title: Type or discipline

PaymentReconciliation.outcome
type: ObjectProperty
comment: Transaction status: error, complete.
domain: PaymentReconciliation
range: code
title: queued | complete | error | partial

MessageHeader.MessageSourceComponent
type: Class
comment: The source application from which this message originated.
subclass of: BackboneElement
subclass of: Restriction
  cardinality: 1
  on property: MessageHeader.source.endpoint
  some values from: url
subclass of: Restriction
  all values from: ContactPoint
  max cardinality: 1
  on property: MessageHeader.source.contact
subclass of: Restriction
  all values from: string
  max cardinality: 1
  on property: MessageHeader.source.version
subclass of: Restriction
  all values from: string
  max cardinality: 1
  on property: MessageHeader.source.software
subclass of: Restriction
  all values from: string
  max cardinality: 1
  on property: MessageHeader.source.name

TestScript.fixture
type: ObjectProperty
comment: Fixture in the test script - by reference (uri). All fixtures are required for the test script to execute.
domain: TestScript
range: TestScriptFixtureComponent
title: Fixture in the test script - by reference (uri)

ChargeItemDefinition.experimental
type: ObjectProperty
comment: A Boolean value to indicate that this charge item definition is authored for testing purposes (or education/evaluation/marketing) and is not intended to be used for genuine usage.
domain: ChargeItemDefinition
range: boolean
sub property of: class
title: For testing purposes, not real usage

Provenance.entity.agent.onBehalfOf
type: ObjectProperty
comment: The individual, device, or organization for whom the change was made.
domain: ProvenanceEntityComponentAgent
range: Reference
title: Who the agent is representing

Contract.term.asset.valuedItem.entityReference
type: ObjectProperty
domain: Contract.TermComponent.ContractAssetComponent.ValuedItemComponent
range: Reference
sub property of: Contract.term.asset.valuedItem.entity

Measure.definition
type: ObjectProperty
comment: Provides a description of an individual term used within the measure.
domain: Measure
range: markdown
title: Defined terms used in the measure documentation

Library.publisher
type: ObjectProperty
comment: The name of the organization or individual that published the library.
domain: Library
range: string
sub property of: who.witness
title: Name of the publisher (organization or individual)

Consent.scope
type: ObjectProperty
comment: A selector of the type of consent being presented: ADR, Privacy, Treatment, Research. This list is now extensible.
domain: Consent
range: CodeableConcept
title: Which of the four areas this resource covers (extensible)

CompartmentDefinition.resource.param
type: ObjectProperty
comment: The name of a search parameter that represents the link to the compartment. More than one may be listed because a resource may be linked to a compartment in more than one way,.
domain: CompartmentDefinitionResourceComponent
range: string
title: Search Parameter Name, or chained parameters

NamingSystem
type: Class
comment: A curated namespace that issues unique symbols within that namespace for the identification of concepts, people, devices, etc. Represents a "System" used within the Identifier and Coding data types.
subclass of: conformance.terminology
subclass of: DomainResource
subclass of: Restriction
  all values from: UsageContext
  on property: NamingSystem.useContext
subclass of: Restriction
  cardinality: 1
  on property: NamingSystem.status
  some values from: code
subclass of: Restriction
  all values from: ContactDetail
  on property: NamingSystem.contact
subclass of: Restriction
  all values from: CodeableConcept
  on property: NamingSystem.jurisdiction
subclass of: Restriction
  all values from: string
  max cardinality: 1
  on property: NamingSystem.responsible
subclass of: Restriction
  cardinality: 1
  on property: NamingSystem.name
  some values from: string
subclass of: Restriction
  all values from: string
  max cardinality: 1
  on property: NamingSystem.publisher
subclass of: Restriction
  cardinality: 1
  on property: NamingSystem.date
  some values from: dateTime
subclass of: Restriction
  all values from: markdown
  max cardinality: 1
  on property: NamingSystem.description
subclass of: Restriction
  on property: NamingSystem.uniqueId
  some values from: NamingSystemUniqueIdComponent
subclass of: Restriction
  all values from: string
  max cardinality: 1
  on property: NamingSystem.usage
subclass of: Restriction
  all values from: CodeableConcept
  max cardinality: 1
  on property: NamingSystem.type
subclass of: Restriction
  cardinality: 1
  on property: NamingSystem.kind
  some values from: code

VisionPrescription
type: Class
comment: An authorization for the supply of glasses and/or contact lenses to a patient.
subclass of: clinical.careprovision
subclass of: DomainResource
subclass of: Restriction
  all values from: Reference
  max cardinality: 1
  on property: VisionPrescription.prescriber
subclass of: Restriction
  all values from: Identifier
  on property: VisionPrescription.identifier
subclass of: Restriction
  all values from: VisionPrescriptionDispenseComponent
  on property: VisionPrescription.dispense
subclass of: Restriction
  all values from: Reference
  max cardinality: 1
  on property: VisionPrescription.patient
subclass of: Restriction
  all values from: code
  max cardinality: 1
  on property: VisionPrescription.status
subclass of:
  union of: Restriction
    all values from: CodeableConcept
    max cardinality: 1
    on property: VisionPrescription.reasonCodeableConcept
  union of: Restriction
    all values from: Reference
    max cardinality: 1
    on property: VisionPrescription.reasonReference
subclass of: Restriction
  all values from: dateTime
  max cardinality: 1
  on property: VisionPrescription.dateWritten
subclass of: Restriction
  all values from: Reference
  max cardinality: 1
  on property: VisionPrescription.encounter

ValueSet.compose.exclude.concept.designation.value
type: ObjectProperty
comment: The text value for this designation.
domain: ValueSetComposeComponentInclude.ConceptReferenceComponent.ConceptReferenceDesignationComponent
range: string
title: The text value for this designation

TestScript.setup
type: ObjectProperty
comment: A series of required setup operations before tests are executed.
domain: TestScript
range: TestScriptSetupComponent
title: A series of required setup operations before tests are executed

PlanDefinitionActionComponent.PlanDefinitionActionRelatedActionComponent
type: Class
comment: A relationship to another action such as "before" or "30-60 minutes after start of".
subclass of: BackboneElement
subclass of:
  union of: Restriction
    all values from: Duration
    max cardinality: 1
    on property: PlanDefinition.action.relatedAction.offsetDuration
  union of: Restriction
    all values from: Range
    max cardinality: 1
    on property: PlanDefinition.action.relatedAction.offsetRange
subclass of: Restriction
  cardinality: 1
  on property: PlanDefinition.action.relatedAction.relationship
  some values from: code
subclass of: Restriction
  cardinality: 1
  on property: PlanDefinition.action.relatedAction.actionId
  some values from: id

Schedule.serviceType
type: ObjectProperty
comment: The specific service that is to be performed during this appointment.
domain: Schedule
range: CodeableConcept
sub property of: class
title: Specific service

Observation.valueBoolean
type: ObjectProperty
domain: Observation
range: boolean
sub property of: Observation.value

MedicinalProductIndication.otherTherapy.therapyRelationshipType
type: ObjectProperty
comment: The type of relationship between the medicinal product indication or contraindication and another therapy.
domain: MedicinalProductIndicationOtherTherapyComponent
range: CodeableConcept
title: The type of relationship between the medicinal product indication or contraindication and another therapy

StructureMap.group.rule.rule.target
type: ObjectProperty
comment: Content to create because of this mapping rule.
domain: StructureMapGroupComponent.StructureMapGroupRuleComponentRule
range: StructureMapGroupComponent.StructureMapGroupRuleComponentRule.StructureMapGroupRuleTargetComponent
title: Content to create because of this mapping rule

OperationDefinition.overload.comment
type: ObjectProperty
comment: Comments to go on overload.
domain: OperationDefinitionOverloadComponent
range: string
title: Comments to go on overload

EntryDefinition.classification
type: ObjectProperty
comment: Classes of devices, or ATC for medication.
domain: EntryDefinition
range: CodeableConcept
title: Classification (category or class) of the item entry

DocumentReference.identifier
type: ObjectProperty
comment: Other identifiers associated with the document, including version independent identifiers.
domain: DocumentReference
range: Identifier
sub property of: id
title: Other identifiers for the document

BodyStructure.patient
type: ObjectProperty
comment: The person to which the body site belongs.
domain: BodyStructure
range: Reference
sub property of: who.focus
title: Who this is about

MedicinalProductDeviceSpec.type
type: ObjectProperty
comment: The type of device.
domain: MedicinalProductDeviceSpec
range: CodeableConcept
title: The type of device

MedicinalProductIngredient.identifier
type: ObjectProperty
comment: The identifier(s) of this Ingredient that are assigned by business processes and/or used to refer to it when a direct URL reference to the resource itself is not appropriate.
domain: MedicinalProductIngredient
range: Identifier
title: Identifier for the ingredient

Coverage.class.value
type: ObjectProperty
comment: For example, the Group or Plan number.
domain: Coverage.ClassComponent
range: string
title: The tag or value under the classification

CoverageEligibilityResponse.insurance.item.category
type: ObjectProperty
comment: High-level Dental, Vision, Medical, Pharmacy, Rehab etc. and detailed types of services: Dental: basic, major, ortho; Vision exam, glasses, contacts; etc.
domain: CoverageEligibilityResponse.InsuranceComponent.ItemsComponent
range: CodeableConcept
title: Type of service

Sequence.referenceSeq.strand
type: ObjectProperty
comment: An absolute reference to a strand. The Watson strand is the strand whose 5'-end is on the short arm of the chromosome, and the Crick strand as the one whose 5'-end is on the long arm.
domain: SequenceReferenceSeqComponent
range: code
title: watson | crick

ExampleScenario.process.step.process.description
type: ObjectProperty
comment: A longer description of the group of operations.
domain: ExampleScenarioProcessComponent.ExampleScenarioProcessStepComponentProcess
range: markdown
title: A longer description of the group of operations

SampledData.period
type: ObjectProperty
comment: The length of time between sampling times, measured in milliseconds.
domain: SampledData
range: decimal
title: Number of milliseconds between samples

MedicinalProductIngredient.specifiedSubstance.strength.presentationLowLimit
type: ObjectProperty
comment: A lower limit for the quantity of substance in the unit of presentation. For use when there is a range of strengths, this is the lower limit, with the presentation attribute becoming the upper limit.
domain: MedicinalProductIngredientSpecifiedSubstanceComponent.MedicinalProductIngredientSpecifiedSubstanceStrengthComponent
range: Ratio
title: A lower limit for the quantity of substance in the unit of presentation. For use when there is a range of strengths, this is the lower limit, with the presentation attribute becoming the upper limit

Contract.version
type: ObjectProperty
comment: An edition identifier used for business purposes to label business significant variants.
domain: Contract
range: string
title: Business edition

ImmunizationEvaluation.doseNumber
type: ObjectProperty

TestScript.ruleset.rule.param.name
type: ObjectProperty
comment: Descriptive name for this parameter that matches the external assert ruleset rule parameter name.
domain: TestScriptRulesetComponent.RulesetRuleComponent.RulesetRuleParamComponent
range: string
title: Parameter name matching external assert ruleset rule parameter

Claim.item.diagnosisSequence
type: ObjectProperty
comment: Diagnosis applicable for this service or product line.
domain: Claim.ItemComponent
range: positiveInt
title: Applicable diagnoses

SubstanceSpecificationStructureComponent
type: Class
comment: Structural information.
subclass of: BackboneElement
subclass of: Restriction
  all values from: CodeableConcept
  max cardinality: 1
  on property: SubstanceSpecification.structure.opticalActivity
subclass of: Restriction
  all values from: CodeableConcept
  max cardinality: 1
  on property: SubstanceSpecification.structure.stereochemistry
subclass of: Restriction
  all values from: SubstanceSpecificationStructureComponentMolecularWeight
  max cardinality: 1
  on property: SubstanceSpecification.structure.molecularWeight
subclass of: Restriction
  all values from: SubstanceSpecificationStructureComponent.SubstanceSpecificationStructureStructuralRepresentationComponent
  on property: SubstanceSpecification.structure.structuralRepresentation
subclass of: Restriction
  all values from: string
  max cardinality: 1
  on property: SubstanceSpecification.structure.molecularFormula
subclass of: Restriction
  all values from: Reference
  on property: SubstanceSpecification.structure.referenceSource
subclass of: Restriction
  all values from: SubstanceSpecificationStructureComponent.SubstanceSpecificationStructureIsotopeComponent
  on property: SubstanceSpecification.structure.isotope
subclass of: Restriction
  all values from: string
  max cardinality: 1
  on property: SubstanceSpecification.structure.molecularFormulaByMoiety

ClaimResponse.insurance.focal
type: ObjectProperty
comment: The instance number of the Coverage which is the focus for adjudication. The Coverage against which the claim is to be adjudicated.
domain: ClaimResponse.InsuranceComponent
range: boolean
title: Is the focal Coverage

DiagnosticReport.identifier
type: ObjectProperty
comment: Identifiers assigned to this report by the performer or other systems.
domain: DiagnosticReport
range: Identifier
sub property of: id
title: Business identifier for report

Provenance.agent.type
type: ObjectProperty
comment: The participation the agent had with respect to the activity.
domain: ProvenanceAgentComponent
range: CodeableConcept
title: How the agent participated

ElementDefinition.slicing.discriminator.type
type: ObjectProperty
comment: How the element value is interpreted when discrimination is evaluated.
domain: ElementDefinitionSlicingComponent.ElementDefinitionSlicingDiscriminatorComponent
range: code
title: value | exists | pattern | type | profile

Measure.supplementalData.description
type: ObjectProperty
comment: The human readable description of this supplemental data.
domain: MeasureSupplementalDataComponent
range: string
title: The human readable description of this supplemental data

Measure.subjectReference
type: ObjectProperty
domain: Measure
range: Reference
sub property of: Measure.subject

ChargeItem.occurrenceDateTime
type: ObjectProperty
domain: ChargeItem
range: dateTime
sub property of: ChargeItem.occurrence

PractitionerRole.availableTime
type: ObjectProperty
comment: A collection of times the practitioner is available or performing this role at the location and/or healthcareservice.
domain: PractitionerRole
range: PractitionerRoleAvailableTimeComponent
title: Times the Service Site is available

Identifier
type: Class
comment: An identifier - identifies some entity uniquely and unambiguously. Typically this is used for business identifiers.
subclass of: Element
subclass of: Restriction
  all values from: Period
  max cardinality: 1
  on property: Identifier.period
subclass of: Restriction
  all values from: uri
  max cardinality: 1
  on property: Identifier.system
subclass of: Restriction
  all values from: string
  max cardinality: 1
  on property: Identifier.value
subclass of: Restriction
  all values from: Reference
  max cardinality: 1
  on property: Identifier.assigner
subclass of: Restriction
  all values from: code
  max cardinality: 1
  on property: Identifier.use
subclass of: Restriction
  all values from: CodeableConcept
  max cardinality: 1
  on property: Identifier.type
title: An identifier intended for computation

ExampleScenario.process.step.alternative.option.step.process.step.operation.receiver
type: ObjectProperty
comment: Who receives the transaction.
domain: ExampleScenarioProcessComponent.ExampleScenarioProcessStepComponent.ExampleScenarioProcessStepAlternativeComponent.ExampleScenarioProcessStepAlternativeOptionComponentStepProcess.ExampleScenarioProcessStepComponent.ExampleScenarioProcessStepOperationComponent
range: string
title: Who receives the transaction

Claim.item.category
type: ObjectProperty
comment: Health Care Service Type Codes to identify the classification of service or benefits.
domain: Claim.ItemComponent
range: CodeableConcept
title: Type of service or product

TerminologyCapabilities.closure
type: ObjectProperty
comment: Whether the $closure operation is supported.
domain: TerminologyCapabilities
range: TerminologyCapabilitiesClosureComponent
title: Information about the [ConceptMap/$closure](conceptmap-operation-closure.html) operation

StructureMap.contact
type: ObjectProperty
comment: Contact details to assist a user in finding and communicating with the publisher.
domain: StructureMap
range: ContactDetail
title: Contact details for the publisher

TestScript.experimental
type: ObjectProperty
comment: A Boolean value to indicate that this test script is authored for testing purposes (or education/evaluation/marketing) and is not intended to be used for genuine usage.
domain: TestScript
range: boolean
sub property of: class
title: For testing purposes, not real usage

ElementDefinition.example.label
type: ObjectProperty
comment: Describes the purpose of this example amoung the set of examples.
domain: ElementDefinitionExampleComponent
range: string
title: Describes the purpose of this example

TestReport.result
type: ObjectProperty
comment: The overall result from the execution of the TestScript.
domain: TestReport
range: code
title: pass | fail | pending

NutritionOrder.enteralFormula.caloricDensity
type: ObjectProperty
comment: The amount of energy (calories) that the formula should provide per specified volume, typically per mL or fluid oz. For example, an infant may require a formula that provides 24 calories per fluid ounce or an adult may require an enteral formula that provides 1.5 calorie/mL.
domain: NutritionOrderEnteralFormulaComponent
range: SimpleQuantity
title: Amount of energy per specified volume that is required

ActivityDefinition.quantity
type: ObjectProperty
comment: Identifies the quantity expected to be consumed at once (per dose, per meal, etc.).
domain: ActivityDefinition
range: SimpleQuantity
title: How much is administered/consumed/supplied

ActivityDefinition.productCodeableConcept
type: ObjectProperty
domain: ActivityDefinition
range: CodeableConcept
sub property of: ActivityDefinition.product

SupplyRequest.reasonReference
type: ObjectProperty
comment: The reason why the supply item was requested.
domain: SupplyRequest
range: Reference
sub property of: why
title: The reason why the supply item was requested

BackboneElement
type: Class
comment: Base definition for all elements that are defined inside a resource - but not those in a data type.
subclass of: Element
subclass of: Restriction
  all values from: Extension
  on property: BackboneElement.modifierExtension
title: Base for elements defined inside a resource

AuditEvent.entity.detail
type: ObjectProperty
comment: Tagged value pairs for conveying additional information about the entity.
domain: AuditEventEntityComponent
range: AuditEventEntityComponent.AuditEventEntityDetailComponent
sub property of: context
title: Additional Information about the entity

SubstanceSpecification.substanceName.type
type: ObjectProperty
comment: Name type.
domain: SubstanceSpecificationSubstanceNameComponent
range: CodeableConcept
title: Name type

Contract.term.asset.valuedItem.unitPrice
type: ObjectProperty
comment: A Contract Valued Item unit valuation measure.
domain: Contract.TermComponent.ContractAssetComponent.ValuedItemComponent
range: Money
sub property of: what
title: Contract Valued Item fee, charge, or cost

Provenance
type: Class
comment: Provenance of a resource is a record that describes entities and processes involved in producing and delivering or otherwise influencing that resource. Provenance provides a critical foundation for assessing authenticity, enabling trust, and allowing reproducibility. Provenance assertions are a form of contextual metadata and can themselves become important records with their own provenance. Provenance statement indicates clinical significance in terms of confidence in authenticity, reliability, and trustworthiness, integrity, and stage in lifecycle (e.g. Document Completion - has the artifact been legally authenticated), all of which may impact security, privacy, and trust policies.
subclass of: DomainResource
subclass of: infrastructure.information
subclass of:
  union of: Restriction
    all values from: Period
    max cardinality: 1
    on property: Provenance.occurredPeriod
  union of: Restriction
    all values from: dateTime
    max cardinality: 1
    on property: Provenance.occurredDateTime
subclass of: Restriction
  cardinality: 1
  on property: Provenance.recorded
  some values from: instant
subclass of: Restriction
  on property: Provenance.agent
  some values from: ProvenanceAgentComponent
subclass of: Restriction
  all values from: uri
  on property: Provenance.policy
subclass of: Restriction
  all values from: ProvenanceEntityComponent
  on property: Provenance.entity
subclass of: Restriction
  all values from: Reference
  max cardinality: 1
  on property: Provenance.location
subclass of: Restriction
  all values from: Signature
  on property: Provenance.signature
subclass of: Restriction
  all values from: CodeableConcept
  on property: Provenance.reason
subclass of: Restriction
  all values from: CodeableConcept
  max cardinality: 1
  on property: Provenance.activity
subclass of: Restriction
  on property: Provenance.target
  some values from: Reference

SpecimenDefinition.specimenToLab.containerType
type: ObjectProperty
comment: The type of container used to contain this kind of specimen.
domain: SpecimenDefinitionSpecimenToLabComponent
range: CodeableConcept
title: Kind of container associated with the kind of specimen

ExampleScenarioProcessComponent.ExampleScenarioProcessStepComponentProcess.ExampleScenarioProcessStepComponent.ExampleScenarioProcessStepAlternativeComponent.ExampleScenarioProcessStepAlternativeOptionComponentStep.ExampleScenarioProcessStepAlternativeComponent
type: Class
comment: Each interaction in the workflow.
subclass of: BackboneElement
subclass of: Restriction
  on property: ExampleScenario.process.step.process.step.alternative.option.step.alternative.option
  some values from: ExampleScenarioProcessComponent.ExampleScenarioProcessStepComponentProcess.ExampleScenarioProcessStepComponent.ExampleScenarioProcessStepAlternativeComponent.ExampleScenarioProcessStepAlternativeOptionComponentStep.ExampleScenarioProcessStepAlternativeComponent.ExampleScenarioProcessStepAlternativeOptionComponent
subclass of: Restriction
  all values from: string
  max cardinality: 1
  on property: ExampleScenario.process.step.process.step.alternative.option.step.alternative.name

QuestionnaireResponse.item.answer.valueString
type: ObjectProperty
domain: QuestionnaireResponseItemComponent.QuestionnaireResponseItemAnswerComponent
range: string
sub property of: QuestionnaireResponse.item.answer.value

CoverageEligibilityResponse.insurance.item.benefit.allowedUnsignedInt
type: ObjectProperty
domain: CoverageEligibilityResponse.InsuranceComponent.ItemsComponent.BenefitComponent
range: unsignedInt
sub property of: CoverageEligibilityResponse.insurance.item.benefit.allowed

ElementDefinition.mustSupport
type: ObjectProperty
comment: If true, implementations that produce or consume resources SHALL provide "support" for the element in some meaningful way. If false, the element may be ignored and not supported. If false, whether to populate or use the data element in any way is at the discretion of the implementation.
domain: ElementDefinition
range: boolean
title: If the element must be supported

GuidanceResponse.moduleUri
type: ObjectProperty
domain: GuidanceResponse
range: uri
sub property of: GuidanceResponse.module

DocumentManifest.masterIdentifier
type: ObjectProperty
comment: A single identifier that uniquely identifies this manifest. Principally used to refer to the manifest in non-FHIR contexts.
domain: DocumentManifest
range: Identifier
sub property of: id
title: Unique Identifier for the set of documents

CompartmentDefinition.resource.code
type: ObjectProperty
comment: The name of a resource supported by the server.
domain: CompartmentDefinitionResourceComponent
range: code
title: Name of resource type

Contract.supportingInfo
type: ObjectProperty
comment: Information that may be needed by/relevant to the performer in their execution of this term action.
domain: Contract
range: Reference
title: Extra Information

CodeSystem.experimental
type: ObjectProperty
comment: A Boolean value to indicate that this code system is authored for testing purposes (or education/evaluation/marketing) and is not intended to be used for genuine usage.
domain: CodeSystem
range: boolean
sub property of: class
title: For testing purposes, not real usage

SubstanceReferenceInformation.target
type: ObjectProperty
comment: Todo.
domain: SubstanceReferenceInformation
range: SubstanceReferenceInformationTargetComponent
title: Todo

SearchParameter.date
type: ObjectProperty
comment: The date (and optionally time) when the search parameter was published. The date must change when the business version changes and it must change if the status code changes. In addition, it should change when the substantive content of the search parameter changes.
domain: SearchParameter
range: dateTime
sub property of: when.recorded
title: Date last changed

Coverage.policyHolder
type: ObjectProperty
comment: The party who 'owns' the insurance policy, may be an individual, corporation or the subscriber's employer.
domain: Coverage
range: Reference
sub property of: who.focus
title: Owner of the policy

ActivityDefinition.author
type: ObjectProperty
comment: An individiual or organization primarily involved in the creation and maintenance of the content.
domain: ActivityDefinition
range: ContactDetail
title: Who authored the content

MedicinalProductClinicalsContraindicationComponentTherapeuticIndicationUndesirableEffects
type: Class
comment: Information about the use of the medicinal product in relation to other therapies as part of the indication.
subclass of: BackboneElement
subclass of: Restriction
  all values from: MedicinalProductClinicalsContraindicationComponentTherapeuticIndicationUndesirableEffects.MedicinalProductClinicalsUndesirableEffectsPopulationComponent
  on property: MedicinalProductClinicals.contraindication.therapeuticIndication.undesirableEffects.population
subclass of: Restriction
  all values from: CodeableConcept
  max cardinality: 1
  on property: MedicinalProductClinicals.contraindication.therapeuticIndication.undesirableEffects.frequencyOfOccurrence
subclass of: Restriction
  all values from: CodeableConcept
  max cardinality: 1
  on property: MedicinalProductClinicals.contraindication.therapeuticIndication.undesirableEffects.classification
subclass of: Restriction
  all values from: CodeableConcept
  max cardinality: 1
  on property: MedicinalProductClinicals.contraindication.therapeuticIndication.undesirableEffects.symptomConditionEffect
title: Information about the use of the medicinal product in relation to other therapies as part of the indication

OperationDefinition.description
type: ObjectProperty
comment: A free text natural language description of the operation definition from a consumer's perspective.
domain: OperationDefinition
range: markdown
title: Natural language description of the operation definition

ChargeItemDefinition.propertyGroup.applicability.description
type: ObjectProperty
comment: A brief, natural language description of the condition that effectively communicates the intended semantics.
domain: ChargeItemDefinitionPropertyGroupComponentApplicability
range: string
title: Natural language description of the condition

MedicationRequest.dispenseRequest.validityPeriod
type: ObjectProperty
comment: This indicates the validity period of a prescription (stale dating the Prescription).
domain: MedicationRequestDispenseRequestComponent
range: Period
title: Time period supply is authorized for

Task.description
type: ObjectProperty
comment: A free-text description of what is to be performed.
domain: Task
range: string
title: Human-readable explanation of task

ConceptMapGroupComponent.SourceElementComponent.TargetElementComponent
type: Class
comment: A concept from the target value set that this concept maps to.
subclass of: BackboneElement
subclass of: Restriction
  all values from: ConceptMapGroupComponent.SourceElementComponent.TargetElementComponentDependsOn
  on property: ConceptMap.group.element.target.product
subclass of: Restriction
  all values from: ConceptMapGroupComponent.SourceElementComponent.TargetElementComponent.OtherElementComponent
  on property: ConceptMap.group.element.target.dependsOn
subclass of: Restriction
  all values from: string
  max cardinality: 1
  on property: ConceptMap.group.element.target.display
subclass of: Restriction
  cardinality: 1
  on property: ConceptMap.group.element.target.equivalence
  some values from: code
subclass of: Restriction
  all values from: code
  max cardinality: 1
  on property: ConceptMap.group.element.target.code
subclass of: Restriction
  all values from: string
  max cardinality: 1
  on property: ConceptMap.group.element.target.comment

ClaimResponse.addItem.subSite
type: ObjectProperty
comment: A region or surface of the site, e.g. limb region or tooth surface(s).
domain: ClaimResponse.AddedItemComponent
range: CodeableConcept
title: Service Sub-location

Signature.who
type: ObjectProperty
comment: A reference to an application-usable description of the identity that signed (e.g. the signature used their private key).
domain: Signature
range: Reference
title: Who signed

MedicationStatement.basedOn
type: ObjectProperty
comment: A plan, proposal or order that is fulfilled in whole or in part by this event.
domain: MedicationStatement
range: Reference
title: Fulfils plan, proposal or order

TestScript.setup.action.assert.ruleset.rule.param.name
type: ObjectProperty
comment: Descriptive name for this parameter that matches the external assert ruleset rule parameter name.
domain: TestScriptSetupComponent.SetupActionComponent.SetupActionAssertComponent.ActionAssertRulesetComponent.ActionAssertRulesetRuleComponent.ActionAssertRulesetRuleParamComponent
range: string
title: Parameter name matching external assert ruleset rule parameter

Group.characteristic.valueCodeableConcept
type: ObjectProperty
domain: GroupCharacteristicComponent
range: CodeableConcept
sub property of: Group.characteristic.value

OperationDefinition.url
type: ObjectProperty
comment: An absolute URI that is used to identify this operation definition when it is referenced in a specification, model, design or an instance; also called its canonical identifier. This SHOULD be globally unique and SHOULD be a literal address at which at which an authoritative instance of this operation definition is (or will be) published. This URL can be the target of a canonical reference. It SHALL remain the same when the operation definition is stored on different servers.
domain: OperationDefinition
range: uri
sub property of: id
title: Canonical identifier for this operation definition, represented as a URI (globally unique)

ImplementationGuide.definition.page.nameUrl
type: ObjectProperty
domain: ImplementationGuideDefinitionComponent.ImplementationGuideDefinitionPageComponent
range: url
sub property of: ImplementationGuide.definition.page.name

Contract.rule.contentAttachment
type: ObjectProperty
domain: Contract.ComputableLanguageComponent
range: Attachment
sub property of: Contract.rule.content

Questionnaire.item.initial.valueInteger
type: ObjectProperty
domain: QuestionnaireItemComponent.QuestionnaireItemInitialComponent
range: integer
sub property of: Questionnaire.item.initial.value

MedicinalProductDeviceSpec.material
type: ObjectProperty
comment: A substance used to create the material(s) of which the device is made.
domain: MedicinalProductDeviceSpec
range: MedicinalProductDeviceSpecMaterialComponent
title: A substance used to create the material(s) of which the device is made

ProdCharacteristic.depth
type: ObjectProperty
comment: Where applicable, the depth can be specified using a numerical value and its unit of measurement The unit of measurement shall be specified in accordance with ISO 11240 and the resulting terminology The symbol and the symbol identifier shall be used.
domain: ProdCharacteristic
range: Quantity
title: Where applicable, the depth can be specified using a numerical value and its unit of measurement The unit of measurement shall be specified in accordance with ISO 11240 and the resulting terminology The symbol and the symbol identifier shall be used

UserSession.workstation
type: ObjectProperty
comment: Location that identifies the physical place at which the user's session is occurring. For the purposes of context synchronization, this is intended to represent the user's workstation.
domain: UserSession
range: Identifier
sub property of: where
title: Where is the session

Contract.term.action.context
type: ObjectProperty
comment: Encounter or Episode with primary association to specified term activity.
domain: Contract.TermComponent.ActionComponent
range: Reference
title: Episode associated with action

Measure.title
type: ObjectProperty
comment: A short, descriptive, user-friendly title for the measure.
domain: Measure
range: string
title: Name for this measure (human friendly)

ExampleScenario.process.step.alternative.option.step.alternative.name
type: ObjectProperty
comment: The name of each alternative.
domain: ExampleScenarioProcessComponent.ExampleScenarioProcessStepComponent.ExampleScenarioProcessStepAlternativeComponent.ExampleScenarioProcessStepAlternativeOptionComponentStep.ExampleScenarioProcessStepAlternativeComponent
range: string
title: The name of each alternative

ImagingStudy.basedOn
type: ObjectProperty
comment: A list of the diagnostic requests that resulted in this imaging study being performed.
domain: ImagingStudy
range: Reference
sub property of: who.cause
title: Request fulfilled

ImplementationGuide.license
type: ObjectProperty
comment: The license that applies to this Implementation Guide, using an SPDX license code, or 'not-open-source'.
domain: ImplementationGuide
range: code
title: SPDX license code for this IG (or not-open-source)

ElementDefinition.type.code
type: ObjectProperty
comment: URL of Data type or Resource that is a(or the) type used for this element. References are URLs that are relative to http://hl7.org/fhir/StructureDefinition e.g. "string" is a reference to http://hl7.org/fhir/StructureDefinition/string. Absolute URLs are only allowed in logical models.
domain: ElementDefinition.TypeRefComponent
range: uri
title: Data type or Resource (reference to definition)

DocumentReference.context.period
type: ObjectProperty
comment: The time period over which the service that is described by the document was provided.
domain: DocumentReferenceContextComponent
range: Period
title: Time of service that is being documented

TestScriptTestComponent.TestActionComponentOperation
type: Class
comment: An operation would involve a REST request to a server.
subclass of: BackboneElement
subclass of: Restriction
  all values from: integer
  max cardinality: 1
  on property: TestScript.test.action.operation.destination
subclass of: Restriction
  all values from: id
  max cardinality: 1
  on property: TestScript.test.action.operation.responseId
subclass of: Restriction
  all values from: integer
  max cardinality: 1
  on property: TestScript.test.action.operation.origin
subclass of: Restriction
  all values from: string
  max cardinality: 1
  on property: TestScript.test.action.operation.label
subclass of: Restriction
  all values from: id
  max cardinality: 1
  on property: TestScript.test.action.operation.targetId
subclass of: Restriction
  cardinality: 1
  on property: TestScript.test.action.operation.encodeRequestUrl
  some values from: boolean
subclass of: Restriction
  all values from: code
  max cardinality: 1
  on property: TestScript.test.action.operation.resource
subclass of: Restriction
  all values from: id
  max cardinality: 1
  on property: TestScript.test.action.operation.sourceId
subclass of: Restriction
  all values from: code
  max cardinality: 1
  on property: TestScript.test.action.operation.accept
subclass of: Restriction
  all values from: string
  max cardinality: 1
  on property: TestScript.test.action.operation.params
subclass of: Restriction
  all values from: string
  max cardinality: 1
  on property: TestScript.test.action.operation.url
subclass of: Restriction
  all values from: string
  max cardinality: 1
  on property: TestScript.test.action.operation.description
subclass of: Restriction
  all values from: Coding
  max cardinality: 1
  on property: TestScript.test.action.operation.type
subclass of: Restriction
  all values from: code
  max cardinality: 1
  on property: TestScript.test.action.operation.contentType
subclass of: Restriction
  all values from: TestScriptTestComponent.TestActionComponentOperation.SetupActionOperationRequestHeaderComponent
  on property: TestScript.test.action.operation.requestHeader
subclass of: Restriction
  all values from: id
  max cardinality: 1
  on property: TestScript.test.action.operation.requestId
title: The setup operation to perform

MedicationDispense.substitution.type
type: ObjectProperty
comment: A code signifying whether a different drug was dispensed from what was prescribed.
domain: MedicationDispenseSubstitutionComponent
range: CodeableConcept
title: Code signifying whether a different drug was dispensed from what was prescribed

EnrollmentResponse.status
type: ObjectProperty
comment: The status of the resource instance.
domain: EnrollmentResponse
range: code
title: active | cancelled | draft | entered-in-error

TestScript.setup.action.assert.ruleset.rule.ruleId
type: ObjectProperty
comment: Id of the referenced rule within the external ruleset template.
domain: TestScriptSetupComponent.SetupActionComponent.SetupActionAssertComponent.ActionAssertRulesetComponent.ActionAssertRulesetRuleComponent
range: id
title: Id of referenced rule within the ruleset

StructureDefinition.description
type: ObjectProperty
comment: A free text natural language description of the structure definition from a consumer's perspective.
domain: StructureDefinition
range: markdown
title: Natural language description of the structure definition

DeviceUseStatement.timingDateTime
type: ObjectProperty
domain: DeviceUseStatement
range: dateTime
sub property of: DeviceUseStatement.timing

ChargeItem.status
type: ObjectProperty
comment: The current state of the ChargeItem.
domain: ChargeItem
range: code
sub property of: status
title: planned | billable | not-billable | aborted | billed | entered-in-error | unknown

ExplanationOfBenefit.item.detail.category
type: ObjectProperty
comment: Health Care Service Type Codes to identify the classification of service or benefits.
domain: ExplanationOfBenefit.ItemComponent.DetailComponent
range: CodeableConcept
title: Type of service or product

ExplanationOfBenefit.precedence
type: ObjectProperty
comment: Precedence (primary, secondary, etc.).
domain: ExplanationOfBenefit
range: positiveInt
title: Precedence (primary, secondary, etc.)

MedicationRequest.medicationCodeableConcept
type: ObjectProperty
domain: MedicationRequest
range: CodeableConcept
sub property of: MedicationRequest.medication

Composition.attester
type: ObjectProperty
comment: A participant who has attested to the accuracy of the composition/document.
domain: Composition
range: CompositionAttesterComponent
title: Attests to accuracy of composition

Consent.provision.provision.action
type: ObjectProperty
comment: Actions controlled by this Rule.
domain: Consent.provisionComponentProvision
range: CodeableConcept
title: Actions controlled by this rule

ClaimResponse.item.adjudication.reason
type: ObjectProperty
comment: Adjudication reason such as limit reached.
domain: ClaimResponse.ItemComponent.AdjudicationComponent
range: CodeableConcept
title: Explanation of Adjudication outcome

Contract.term.group.identifier
type: ObjectProperty
comment: Unique identifier for this particular Contract Provision.
domain: Contract.TermComponentTerm
range: Identifier
title: Contract Term Number

StructureMap.group.rule.target.parameter.value
type: ObjectProperty

Composition.custodian
type: ObjectProperty
comment: Identifies the organization or group who is responsible for ongoing maintenance of and access to the composition/document information.
domain: Composition
range: Reference
title: Organization which maintains the composition

AllergyIntolerance.code
type: ObjectProperty
comment: Code for an allergy or intolerance statement (either a positive or a negated/excluded statement). This may be a code for a substance or pharmaceutical product that is considered to be responsible for the adverse reaction risk (e.g., "Latex"), an allergy or intolerance condition (e.g., "Latex allergy"), or a negated/excluded code for a specific substance or class (e.g., "No latex allergy") or a general or categorical negated statement (e.g., "No known allergy", "No known drug allergies"). Note: the substance for a specific reaction may be different from the substance identified as the cause of the risk, but it must be consistent with it. For instance, it may be a more specific substance (e.g. a brand medication) or a composite product that includes the identified substance. It must be clinically safe to only process the 'code' and ignore the 'reaction.substance'. If a receiving system is unable to confirm that AllergyIntolerance.reaction.substance falls within the semantic scope of AllergyIntolerance.code, then the receiving system should ignore AllergyIntolerance.reaction.substance.
domain: AllergyIntolerance
range: CodeableConcept
sub property of: what
title: Code that identifies the allergy or intolerance

InsurancePlan.administeredBy
type: ObjectProperty
comment: An organization which administer other services such as underwriting, customer service and/or claims processing on behalf of the health insurance product owner.
domain: InsurancePlan
range: Reference
title: Product administrator

MedicationAdministration.performer.actor
type: ObjectProperty
comment: Indicates who or what performed the medication administration.
domain: MedicationAdministrationPerformerComponent
range: Reference
title: Who performed the medication administration

DeviceDefinition.property.type
type: ObjectProperty
comment: Code that specifies the property DeviceDefinitionPropetyCode (Extensible).
domain: DeviceDefinitionPropertyComponent
range: CodeableConcept
title: Code that specifies the property DeviceDefinitionPropetyCode (Extensible)

Contract.legal.content
type: ObjectProperty

GraphDefinition.name
type: ObjectProperty
comment: A natural language name identifying the graph definition. This name should be usable as an identifier for the module by machine processing applications such as code generation.
domain: GraphDefinition
range: string
title: Name for this graph definition (computer friendly)

DeviceMetric.type
type: ObjectProperty
comment: Describes the type of the metric. For example: Heart Rate, PEEP Setting, etc.
domain: DeviceMetric
range: CodeableConcept
sub property of: class
title: Identity of metric, for example Heart Rate or PEEP Setting

ImplementationGuide.manifest
type: ObjectProperty
comment: Information about an assembled implementation guide, created by the publication tooling.
domain: ImplementationGuide
range: ImplementationGuideManifestComponent
title: Information about an assembled IG

Endpoint
type: Class
comment: The technical details of an endpoint that can be used for electronic services, such as for web services providing XDS.b or a REST endpoint for another FHIR server. This may include any security context information.
subclass of: DomainResource
subclass of: infrastructure.exchange
subclass of: Restriction
  all values from: ContactPoint
  on property: Endpoint.contact
subclass of: Restriction
  all values from: string
  max cardinality: 1
  on property: Endpoint.name
subclass of: Restriction
  on property: Endpoint.payloadType
  some values from: CodeableConcept
subclass of: Restriction
  all values from: code
  on property: Endpoint.payloadMimeType
subclass of: Restriction
  all values from: Identifier
  on property: Endpoint.identifier
subclass of: Restriction
  all values from: Reference
  max cardinality: 1
  on property: Endpoint.managingOrganization
subclass of: Restriction
  all values from: string
  on property: Endpoint.header
subclass of: Restriction
  cardinality: 1
  on property: Endpoint.connectionType
  some values from: Coding
subclass of: Restriction
  all values from: Period
  max cardinality: 1
  on property: Endpoint.period
subclass of: Restriction
  cardinality: 1
  on property: Endpoint.address
  some values from: url
subclass of: Restriction
  cardinality: 1
  on property: Endpoint.status
  some values from: code

DiagnosticReport.subject
type: ObjectProperty
comment: The subject of the report. Usually, but not always, this is a patient. However diagnostic services also perform analyses on specimens collected from a variety of other sources.
domain: DiagnosticReport
range: Reference
sub property of: who.focus
title: The subject of the report - usually, but not always, the patient

CoverageEligibilityResponse.requestProvider
type: ObjectProperty
comment: The provider who is responsible for the services rendered to the patient.
domain: CoverageEligibilityResponse
range: Reference
sub property of: who.source
title: Responsible provider

Observation.component.valueQuantity
type: ObjectProperty
domain: ObservationComponentComponent
range: Quantity
sub property of: Observation.component.value

ValueSet.compose.include
type: ObjectProperty
comment: Include one or more codes from a code system or other value set(s).
domain: ValueSetComposeComponent
range: ValueSetComposeComponent.ConceptSetComponent
title: Include one or more codes from a code system or other value set(s)

PlanDefinition.action.action.groupingBehavior
type: ObjectProperty
comment: Defines the grouping behavior for the action and its children.
domain: PlanDefinitionActionComponentAction
range: code
title: visual-group | logical-group | sentence-group

Slot.serviceType
type: ObjectProperty
comment: The type of appointments that can be booked into this slot (ideally this would be an identifiable service - which is at a location, rather than the location itself). If provided then this overrides the value provided on the availability resource.
domain: Slot
range: CodeableConcept
sub property of: class
title: The type of appointments that can be booked into this slot (ideally this would be an identifiable service - which is at a location, rather than the location itself). If provided then this overrides the value provided on the availability resource

VisionPrescription.prescriber
type: ObjectProperty
comment: The healthcare professional responsible for authorizing the prescription.
domain: VisionPrescription
range: Reference
sub property of: who.author
title: Who authorizes the vision product

HealthcareService.telecom
type: ObjectProperty
comment: List of contacts related to this specific healthcare service.
domain: HealthcareService
range: ContactPoint
title: Contacts related to the healthcare service

ExampleScenario.jurisdiction
type: ObjectProperty
comment: A legal or geographic region in which the example scenario is intended to be used.
domain: ExampleScenario
range: CodeableConcept
title: Intended jurisdiction for example scenario (if applicable)

SubstanceReferenceInformation.target.organism
type: ObjectProperty
comment: Todo.
domain: SubstanceReferenceInformationTargetComponent
range: CodeableConcept
title: Todo

ImagingStudy.series.specimen
type: ObjectProperty
comment: The specimen imaged, e.g., for whole slide imaging of a biopsy.
domain: ImagingStudySeriesComponent
range: Reference
title: Specimen imaged

RequestGroup.action.action.condition.kind
type: ObjectProperty
comment: The kind of condition.
domain: RequestGroupActionComponentAction.RequestGroupActionConditionComponent
range: code
title: applicability | start | stop

ActivityDefinition.timing
type: ObjectProperty

Account.guarantor.party
type: ObjectProperty
comment: The entity who is responsible.
domain: Account.GuarantorComponent
range: Reference
title: Responsible entity

Contract.term.topicReference
type: ObjectProperty
domain: Contract.TermComponent
range: Reference
sub property of: Contract.term.topic

ElementDefinition.contentReference
type: ObjectProperty
comment: Identifies an element defined elsewhere in the definition whose content rules should be applied to the current element. ContentReferences bring across all the rules that are in the ElementDefinition for the element, including definitions, cardinality constraints, bindings, invariants etc.
domain: ElementDefinition
range: uri
title: Reference to definition of content for the element

PlanDefinition.action.relatedAction.offsetDuration
type: ObjectProperty
domain: PlanDefinitionActionComponent.PlanDefinitionActionRelatedActionComponent
range: Duration
sub property of: PlanDefinition.action.relatedAction.offset

ExampleScenario.process.step.process.step.alternative.option.step.operation.number
type: ObjectProperty
comment: The sequential number of the interaction, e.g. 1.2.5.
domain: ExampleScenarioProcessComponent.ExampleScenarioProcessStepComponentProcess.ExampleScenarioProcessStepComponent.ExampleScenarioProcessStepAlternativeComponent.ExampleScenarioProcessStepAlternativeOptionComponentStep.ExampleScenarioProcessStepOperationComponent
range: string
title: The sequential number of the interaction

ExplanationOfBenefit.addItem.detail.subDetail.adjudication.value
type: ObjectProperty
comment: A non-monetary value for example a percentage. Mutually exclusive to the amount element above.
domain: ExplanationOfBenefit.AddedItemComponent.AddedItemDetailComponent.AddedItemDetailSubDetailComponentAdjudication
range: decimal
title: Non-monitory value

StructureDefinition.useContext
type: ObjectProperty
comment: The content was developed with a focus and intent of supporting the contexts that are listed. These terms may be used to assist with indexing and searching for appropriate structure definition instances.
domain: StructureDefinition
range: UsageContext
title: The context that the content is intended to support

ExplanationOfBenefit.diagnosis.diagnosis
type: ObjectProperty

CapabilityStatement.rest.operation
type: ObjectProperty
comment: Definition of an operation or a named query together with its parameters and their meaning and type.
domain: CapabilityStatementRestComponent
range: CapabilityStatementRestComponentOperation
title: Definition of a system level operation

PlanDefinition.action.timingRange
type: ObjectProperty
domain: PlanDefinitionActionComponent
range: Range
sub property of: PlanDefinition.action.timing

Observation.dataAbsentReason
type: ObjectProperty
comment: Provides a reason why the expected value in the element Observation.value[x] is missing.
domain: Observation
range: CodeableConcept
title: Why the result is missing

MedicinalProductContraindication.subject
type: ObjectProperty
comment: The medication for which this is an indication.
domain: MedicinalProductContraindication
range: Reference
title: The medication for which this is an indication

Location.position.latitude
type: ObjectProperty
comment: Latitude. The value domain and the interpretation are the same as for the text of the latitude element in KML (see notes below).
domain: LocationPositionComponent
range: decimal
title: Latitude with WGS84 datum

Consent.verification
type: ObjectProperty
comment: Whether a treatment instruction (e.g. artificial respiration yes or no) was verified with the patient, his/her family or another authorized person.
domain: Consent
range: ConsentVerificationComponent
title: Consent Verified by patient or family

MedicationKnowledge.monograph.source
type: ObjectProperty
comment: Associated documentation about the medication.
domain: MedicationKnowledgeMonographComponent
range: Reference
title: Associated documentation about the medication

Procedure.performedAge
type: ObjectProperty
domain: Procedure
range: Age
sub property of: Procedure.performed

Address.country
type: ObjectProperty
comment: Country - a nation as commonly understood or generally accepted.
domain: Address
range: string
title: Country (e.g. can be ISO 3166 2 or 3 letter code)

Claim.diagnosis.diagnosisCodeableConcept
type: ObjectProperty
domain: Claim.DiagnosisComponent
range: CodeableConcept
sub property of: Claim.diagnosis.diagnosis

ProdCharacteristic.externalDiameter
type: ObjectProperty
comment: Where applicable, the external diameter can be specified using a numerical value and its unit of measurement The unit of measurement shall be specified in accordance with ISO 11240 and the resulting terminology The symbol and the symbol identifier shall be used.
domain: ProdCharacteristic
range: Quantity
title: Where applicable, the external diameter can be specified using a numerical value and its unit of measurement The unit of measurement shall be specified in accordance with ISO 11240 and the resulting terminology The symbol and the symbol identifier shall be used

OperationDefinition.parameter.part
type: ObjectProperty
comment: The parts of a nested Parameter.
domain: OperationDefinitionParameterComponent
range: OperationDefinitionParameterComponentParameter
title: Parts of a nested Parameter

Appointment.specialty
type: ObjectProperty
comment: The specialty of a practitioner that would be required to perform the service requested in this appointment.
domain: Appointment
range: CodeableConcept
sub property of: class
title: The specialty of a practitioner that would be required to perform the service requested in this appointment

Library.effectivePeriod
type: ObjectProperty
comment: The period during which the library content was or is planned to be in active use.
domain: Library
range: Period
title: When the library is expected to be used

MedicinalProduct.additionalMonitoringIndicator
type: ObjectProperty
comment: Whether the Medicinal Product is subject to additional monitoring for regulatory reasons.
domain: MedicinalProduct
range: CodeableConcept
title: Whether the Medicinal Product is subject to additional monitoring for regulatory reasons

Claim.procedure.procedureCodeableConcept
type: ObjectProperty
domain: Claim.ProcedureComponent
range: CodeableConcept
sub property of: Claim.procedure.procedure

Person.link.target
type: ObjectProperty
comment: The resource to which this actual person is associated.
domain: PersonLinkComponent
range: Reference
title: The resource to which this actual person is associated

Claim.ItemComponent.DetailComponent
type: Class
comment: Second tier of goods and services.
subclass of: BackboneElement
subclass of: Restriction
  all values from: CodeableConcept
  on property: Claim.item.detail.modifier
subclass of: Restriction
  all values from: SimpleQuantity
  max cardinality: 1
  on property: Claim.item.detail.quantity
subclass of: Restriction
  all values from: CodeableConcept
  on property: Claim.item.detail.programCode
subclass of: Restriction
  all values from: CodeableConcept
  max cardinality: 1
  on property: Claim.item.detail.revenue
subclass of: Restriction
  all values from: decimal
  max cardinality: 1
  on property: Claim.item.detail.factor
subclass of: Restriction
  all values from: CodeableConcept
  max cardinality: 1
  on property: Claim.item.detail.billcode
subclass of: Restriction
  all values from: Reference
  on property: Claim.item.detail.udi
subclass of: Restriction
  all values from: Money
  max cardinality: 1
  on property: Claim.item.detail.unitPrice
subclass of: Restriction
  cardinality: 1
  on property: Claim.item.detail.sequence
  some values from: positiveInt
subclass of: Restriction
  all values from: Money
  max cardinality: 1
  on property: Claim.item.detail.net
subclass of: Restriction
  all values from: Claim.ItemComponent.DetailComponent.SubDetailComponent
  on property: Claim.item.detail.subDetail
subclass of: Restriction
  all values from: CodeableConcept
  max cardinality: 1
  on property: Claim.item.detail.category

Subscription
type: Class
comment: The subscription resource is used to define a push-based subscription from a server to another system. Once a subscription is registered with the server, the server checks every resource that is created or updated, and if the resource matches the given criteria, it sends a message on the defined "channel" so that another system can take an appropriate action.
subclass of: infrastructure.exchange
subclass of: DomainResource
subclass of: Restriction
  all values from: ContactPoint
  on property: Subscription.contact
subclass of: Restriction
  cardinality: 1
  on property: Subscription.reason
  some values from: string
subclass of: Restriction
  all values from: Coding
  on property: Subscription.tag
subclass of: Restriction
  all values from: string
  max cardinality: 1
  on property: Subscription.error
subclass of: Restriction
  cardinality: 1
  on property: Subscription.channel
  some values from: SubscriptionChannelComponent
subclass of: Restriction
  cardinality: 1
  on property: Subscription.status
  some values from: code
subclass of: Restriction
  all values from: instant
  max cardinality: 1
  on property: Subscription.end
subclass of: Restriction
  cardinality: 1
  on property: Subscription.criteria
  some values from: string

ExampleScenario.process.step.process.step.alternative.option.step.operation.request.resourceId
type: ObjectProperty
comment: Each resource contained in the instance.
domain: ExampleScenarioProcessComponent.ExampleScenarioProcessStepComponentProcess.ExampleScenarioProcessStepComponent.ExampleScenarioProcessStepAlternativeComponent.ExampleScenarioProcessStepAlternativeOptionComponentStep.ExampleScenarioProcessStepOperationComponentContainedInstance
range: string
title: Each resource contained in the instance

TestScript.variable.sourceId
type: ObjectProperty
comment: Fixture to evaluate the XPath/JSONPath expression or the headerField against within this variable.
domain: TestScriptVariableComponent
range: id
title: Fixture Id of source expression or headerField within this variable

MedicinalProductClinicalsUndesirableEffectsComponent.MedicinalProductClinicalsUndesirableEffectsPopulationComponent
type: Class
comment: The population group to which this applies.
subclass of: BackboneElement
subclass of: Restriction
  all values from: CodeableConcept
  max cardinality: 1
  on property: MedicinalProductClinicals.undesirableEffects.population.physiologicalCondition
subclass of: Restriction
  all values from: CodeableConcept
  max cardinality: 1
  on property: MedicinalProductClinicals.undesirableEffects.population.race
subclass of: Restriction
  all values from: CodeableConcept
  max cardinality: 1
  on property: MedicinalProductClinicals.undesirableEffects.population.gender
subclass of:
  union of: Restriction
    all values from: Range
    max cardinality: 1
    on property: MedicinalProductClinicals.undesirableEffects.population.ageRange
  union of: Restriction
    all values from: CodeableConcept
    max cardinality: 1
    on property: MedicinalProductClinicals.undesirableEffects.population.ageCodeableConcept

Ratio.numerator
type: ObjectProperty
comment: The value of the numerator.
domain: Ratio
range: Quantity
title: Numerator value

TestReport.teardown.action.operation.result
type: ObjectProperty
comment: The result of this operation.
domain: TestReportTeardownComponent.TeardownActionComponentOperation
range: code
title: pass | skip | fail | warning | error

Questionnaire.item.item.answerOption.initialSelected
type: ObjectProperty
comment: Indicates whether the answer value is selected when the list of possible answers is initially shown.
domain: QuestionnaireItemComponentItem.QuestionnaireItemAnswerOptionComponent
range: boolean
title: Whether option is selected by default

ActivityDefinition.useContext
type: ObjectProperty
comment: The content was developed with a focus and intent of supporting the contexts that are listed. These terms may be used to assist with indexing and searching for appropriate activity definition instances.
domain: ActivityDefinition
range: UsageContext
title: The context that the content is intended to support

ClaimResponse.ItemComponent.ItemDetailComponent
type: Class
comment: The second-tier service adjudications for submitted services.
subclass of: BackboneElement
subclass of: Restriction
  all values from: ClaimResponse.ItemComponent.ItemDetailComponent.SubDetailComponent
  on property: ClaimResponse.item.detail.subDetail
subclass of: Restriction
  all values from: ClaimResponse.ItemComponent.ItemDetailComponentAdjudication
  on property: ClaimResponse.item.detail.adjudication
subclass of: Restriction
  all values from: positiveInt
  on property: ClaimResponse.item.detail.noteNumber
subclass of: Restriction
  cardinality: 1
  on property: ClaimResponse.item.detail.detailSequence
  some values from: positiveInt

EntryDefinition.validityPeriod
type: ObjectProperty
comment: The time period in which this catalog entry is expected to be active.
domain: EntryDefinition
range: Period
title: The time period in which this catalog entry is expected to be active

ImplementationGuide.manifest.image
type: ObjectProperty
comment: Indicates a relative path to an image that exists within the IG.
domain: ImplementationGuideManifestComponent
range: string
title: Image within the IG

Claim.accident.location
type: ObjectProperty

MedicinalProductDeviceSpec.listingNumber
type: ObjectProperty
comment: Device listing number.
domain: MedicinalProductDeviceSpec
range: string
title: Device listing number

ImmunizationEvaluation.doseNumberPositiveInt
type: ObjectProperty
domain: ImmunizationEvaluation
range: positiveInt
sub property of: ImmunizationEvaluation.doseNumber

TestScript.setup.action.assert.label
type: ObjectProperty
comment: The label would be used for tracking/logging purposes by test engines.
domain: TestScriptSetupComponent.SetupActionComponent.SetupActionAssertComponent
range: string
title: Tracking/logging assertion label

Claim.ItemComponent.DetailComponent.SubDetailComponent
type: Class
comment: Third tier of goods and services.
subclass of: BackboneElement
subclass of: Restriction
  all values from: SimpleQuantity
  max cardinality: 1
  on property: Claim.item.detail.subDetail.quantity
subclass of: Restriction
  all values from: CodeableConcept
  max cardinality: 1
  on property: Claim.item.detail.subDetail.category
subclass of: Restriction
  all values from: Money
  max cardinality: 1
  on property: Claim.item.detail.subDetail.net
subclass of: Restriction
  all values from: Reference
  on property: Claim.item.detail.subDetail.udi
subclass of: Restriction
  all values from: CodeableConcept
  max cardinality: 1
  on property: Claim.item.detail.subDetail.billcode
subclass of: Restriction
  all values from: CodeableConcept
  on property: Claim.item.detail.subDetail.modifier
subclass of: Restriction
  all values from: Money
  max cardinality: 1
  on property: Claim.item.detail.subDetail.unitPrice
subclass of: Restriction
  all values from: decimal
  max cardinality: 1
  on property: Claim.item.detail.subDetail.factor
subclass of: Restriction
  cardinality: 1
  on property: Claim.item.detail.subDetail.sequence
  some values from: positiveInt
subclass of: Restriction
  all values from: CodeableConcept
  on property: Claim.item.detail.subDetail.programCode
subclass of: Restriction
  all values from: CodeableConcept
  max cardinality: 1
  on property: Claim.item.detail.subDetail.revenue

InsurancePlan.coverage.benefit.type
type: ObjectProperty
comment: Type of benefit (primary care; speciality care; inpatient; outpatient).
domain: InsurancePlanCoverageComponent.CoverageBenefitComponent
range: CodeableConcept
title: Type of benefit

MedicinalProductDeviceSpec.modelNumber
type: ObjectProperty
comment: Device model or reference number.
domain: MedicinalProductDeviceSpec
range: string
title: Device model or reference number

MedicinalProductIngredient.substance.strength.country
type: ObjectProperty
comment: The country or countries for which the strength range applies.
domain: MedicinalProductIngredientSubstanceComponentStrength
range: CodeableConcept
title: The country or countries for which the strength range applies

Condition.stage
type: ObjectProperty
comment: Clinical stage or grade of a condition. May include formal severity assessments.
domain: Condition
range: ConditionStageComponent
title: Stage/grade, usually assessed formally

MedicationAdministration.statusReason
type: ObjectProperty
comment: A code indicating why the administration was not performed.
domain: MedicationAdministration
range: CodeableConcept
title: Reason administration not performed

CoverageEligibilityRequest.DetailsComponent.DiagnosisComponent
type: Class
comment: List of patient diagnosis for which care is sought.
subclass of: BackboneElement
subclass of:
  union of: Restriction
    all values from: CodeableConcept
    max cardinality: 1
    on property: CoverageEligibilityRequest.item.diagnosis.diagnosisCodeableConcept
  union of: Restriction
    all values from: Reference
    max cardinality: 1
    on property: CoverageEligibilityRequest.item.diagnosis.diagnosisReference

SubstanceSpecification.substanceCode
type: ObjectProperty
comment: Codes associated with the substance.
domain: SubstanceSpecification
range: SubstanceSpecificationSubstanceCodeComponent
title: Codes associated with the substance

Sequence.quality.score
type: ObjectProperty
comment: The score of an experimentally derived feature such as a p-value ([SO:0001685](http://www.sequenceontology.org/browser/current_svn/term/SO:0001685)).
domain: SequenceQualityComponent
range: Quantity
title: Quality score for the comparison

Measure.improvementNotation
type: ObjectProperty
comment: Information on whether an increase or decrease in score is the preferred result (e.g., a higher score indicates better quality OR a lower score indicates better quality OR quality is within a range).
domain: Measure
range: code
title: increase | decrease

AdverseEvent.location
type: ObjectProperty
comment: The information about where the adverse event occurred.
domain: AdverseEvent
range: Reference
title: Location where adverse event occurred

Measure.disclaimer
type: ObjectProperty
comment: Notices and disclaimers regarding the use of the measure or related to intellectual property (such as code systems) referenced by the measure.
domain: Measure
range: markdown
title: Disclaimer for use of the measure or its referenced content

ConceptMap.contact
type: ObjectProperty
comment: Contact details to assist a user in finding and communicating with the publisher.
domain: ConceptMap
range: ContactDetail
title: Contact details for the publisher

RiskAssessment.prediction.probability
type: ObjectProperty

Expression.language
type: ObjectProperty
comment: The media type of the language for the expression.
domain: Expression
range: code
title: text/cql | text/fhirpath | application/x-fhir-query | etc.

ServiceRequest.doNotPerform
type: ObjectProperty
comment: Set this to true if the record is saying that the service/procedure should NOT be performed.
domain: ServiceRequest
range: boolean
title: True if service/procedure should not be performed

EventDefinition.author
type: ObjectProperty
comment: An individiual or organization primarily involved in the creation and maintenance of the content.
domain: EventDefinition
range: ContactDetail
title: Who authored the content

RequestGroup.action.timingDuration
type: ObjectProperty
domain: RequestGroupActionComponent
range: Duration
sub property of: RequestGroup.action.timing

TestReport.test.action.operation.result
type: ObjectProperty
comment: The result of this operation.
domain: TestReportTestComponent.TestActionComponentOperation
range: code
title: pass | skip | fail | warning | error

ExplanationOfBenefit.information
type: ObjectProperty
comment: Additional information codes regarding exceptions, special considerations, the condition, situation, prior or concurrent issues. Often there are mutiple jurisdiction specific valuesets which are required.
domain: ExplanationOfBenefit
range: ExplanationOfBenefit.SupportingInformationComponent
title: Exceptions, special considerations, the condition, situation, prior or concurrent issues

CapabilityStatement.rest.resource.searchParam.definition
type: ObjectProperty
comment: An absolute URI that is a formal reference to where this parameter was first defined, so that a client can be confident of the meaning of the search parameter (a reference to [SearchParameter.url]). This element SHALL be populated if the search parameter refers to a SearchParameter defined by the FHIR core specification or externally defined IGs.
domain: CapabilityStatementRestComponent.CapabilityStatementRestResourceComponent.CapabilityStatementRestResourceSearchParamComponent
range: canonical
title: Source of definition for parameter

TestScript.test.description
type: ObjectProperty
comment: A short description of the test used by test engines for tracking and reporting purposes.
domain: TestScriptTestComponent
range: string
title: Tracking/reporting short description of the test

Composition.SectionComponent
type: Class
comment: The root of the sections that make up the composition.
subclass of: BackboneElement
subclass of: Restriction
  all values from: code
  max cardinality: 1
  on property: Composition.section.mode
subclass of: Restriction
  all values from: Narrative
  max cardinality: 1
  on property: Composition.section.text
subclass of: Restriction
  all values from: Composition.SectionComponentSection
  on property: Composition.section.section
subclass of: Restriction
  all values from: CodeableConcept
  max cardinality: 1
  on property: Composition.section.code
subclass of: Restriction
  all values from: Reference
  on property: Composition.section.author
subclass of: Restriction
  all values from: CodeableConcept
  max cardinality: 1
  on property: Composition.section.emptyReason
subclass of: Restriction
  all values from: CodeableConcept
  max cardinality: 1
  on property: Composition.section.orderedBy
subclass of: Restriction
  all values from: string
  max cardinality: 1
  on property: Composition.section.title
subclass of: Restriction
  all values from: Reference
  on property: Composition.section.entry

RequestGroup.replaces
type: ObjectProperty
comment: Completed or terminated request(s) whose function is taken by this new request.
domain: RequestGroup
range: Reference
title: Request(s) replaced by this request

OperationDefinition.overload
type: ObjectProperty
comment: Defines an appropriate combination of parameters to use when invoking this operation, to help code generators when generating overloaded parameter sets for this operation.
domain: OperationDefinition
range: OperationDefinitionOverloadComponent
title: Define overloaded variants for when generating code

ExampleScenario.process.step.alternative.option.step.process.step.alternative.option.description
type: ObjectProperty
comment: A human-readable description of each option.
domain: ExampleScenarioProcessComponent.ExampleScenarioProcessStepComponent.ExampleScenarioProcessStepAlternativeComponent.ExampleScenarioProcessStepAlternativeOptionComponentStepProcess.ExampleScenarioProcessStepComponent.ExampleScenarioProcessStepAlternativeComponent.ExampleScenarioProcessStepAlternativeOptionComponent
range: markdown
title: A human-readable description of each option

Contract.TermComponentTerm.ContractAssetComponent.ValuedItemComponent
type: Class
comment: Contract Valued Item List.
subclass of: BackboneElement
subclass of:
  union of: Restriction
    all values from: CodeableConcept
    max cardinality: 1
    on property: Contract.term.group.asset.valuedItem.entityCodeableConcept
  union of: Restriction
    all values from: Reference
    max cardinality: 1
    on property: Contract.term.group.asset.valuedItem.entityReference
subclass of: Restriction
  all values from: string
  on property: Contract.term.group.asset.valuedItem.linkId
subclass of: Restriction
  all values from: Reference
  max cardinality: 1
  on property: Contract.term.group.asset.valuedItem.recipient
subclass of: Restriction
  all values from: string
  max cardinality: 1
  on property: Contract.term.group.asset.valuedItem.payment
subclass of: Restriction
  all values from: Money
  max cardinality: 1
  on property: Contract.term.group.asset.valuedItem.net
subclass of: Restriction
  all values from: decimal
  max cardinality: 1
  on property: Contract.term.group.asset.valuedItem.points
subclass of: Restriction
  all values from: Identifier
  max cardinality: 1
  on property: Contract.term.group.asset.valuedItem.identifier
subclass of: Restriction
  all values from: decimal
  max cardinality: 1
  on property: Contract.term.group.asset.valuedItem.factor
subclass of: Restriction
  all values from: Money
  max cardinality: 1
  on property: Contract.term.group.asset.valuedItem.unitPrice
subclass of: Restriction
  all values from: Reference
  max cardinality: 1
  on property: Contract.term.group.asset.valuedItem.responsible
subclass of: Restriction
  all values from: unsignedInt
  on property: Contract.term.group.asset.valuedItem.securityLabelNumber
subclass of: Restriction
  all values from: dateTime
  max cardinality: 1
  on property: Contract.term.group.asset.valuedItem.paymentDate
subclass of: Restriction
  all values from: dateTime
  max cardinality: 1
  on property: Contract.term.group.asset.valuedItem.effectiveTime
subclass of: Restriction
  all values from: SimpleQuantity
  max cardinality: 1
  on property: Contract.term.group.asset.valuedItem.quantity

NutritionOrder.orderer
type: ObjectProperty
comment: The practitioner that holds legal responsibility for ordering the diet, nutritional supplement, or formula feedings.
domain: NutritionOrder
range: Reference
sub property of: who.author
title: Who ordered the diet, formula or nutritional supplement

ImmunizationRecommendationRecommendationComponent.ImmunizationRecommendationRecommendationDateCriterionComponent
type: Class
comment: Vaccine date recommendations. For example, earliest date to administer, latest date to administer, etc.
subclass of: BackboneElement
subclass of: Restriction
  cardinality: 1
  on property: ImmunizationRecommendation.recommendation.dateCriterion.value
  some values from: dateTime
subclass of: Restriction
  cardinality: 1
  on property: ImmunizationRecommendation.recommendation.dateCriterion.code
  some values from: CodeableConcept

BodyStructure.location
type: ObjectProperty
comment: The anatomical location or region of the specimen, lesion, or body structure.
domain: BodyStructure
range: CodeableConcept
sub property of: what
title: Body site

Contract.term.asset.valuedItem.payment
type: ObjectProperty
comment: Terms of valuation.
domain: Contract.TermComponent.ContractAssetComponent.ValuedItemComponent
range: string
title: Terms of valuation

Device.partNumber
type: ObjectProperty
comment: The part number of thedevice.
domain: Device
range: string
sub property of: what
title: The part number of the device

SubstanceSpecification.substanceCode.comment
type: ObjectProperty
comment: Any comment can be provided in this field, if necessary.
domain: SubstanceSpecificationSubstanceCodeComponent
range: string
title: Any comment can be provided in this field, if necessary

ImmunizationEvaluation.doseStatus
type: ObjectProperty
comment: Indicates if the dose is valid or not valid with respect to the published recommendations.
domain: ImmunizationEvaluation
range: CodeableConcept
title: Status of the dose relative to published recommendations

ClaimResponse.error.itemSequence
type: ObjectProperty
comment: The sequence number of the line item submitted which contains the error. This value is omitted when the error is elsewhere.
domain: ClaimResponse.ErrorComponent
range: positiveInt
title: Item sequence number

Endpoint.managingOrganization
type: ObjectProperty
comment: The organization that manages this endpoint (even if technically another organization is hosting this in the cloud, it is the organization associated with the data).
domain: Endpoint
range: Reference
title: Organization that manages this endpoint (might not be the organization that exposes the endpoint)

MedicationKnowledge.administrationGuidelines.patientCharacteristics.value
type: ObjectProperty
comment: The specific characteristic (e.g. height, weight, gender, etc).
domain: MedicationKnowledgeAdministrationGuidelinesComponent.MedicationKnowledgeAdministrationGuidelinesPatientCharacteristicsComponent
range: string
title: The specific characteristic

ExampleScenario.process.step.process.step.alternative.option.step.operation.request
type: ObjectProperty
comment: Each resource instance used by the initiator.
domain: ExampleScenarioProcessComponent.ExampleScenarioProcessStepComponentProcess.ExampleScenarioProcessStepComponent.ExampleScenarioProcessStepAlternativeComponent.ExampleScenarioProcessStepAlternativeOptionComponentStep.ExampleScenarioProcessStepOperationComponent
range: ExampleScenarioProcessComponent.ExampleScenarioProcessStepComponentProcess.ExampleScenarioProcessStepComponent.ExampleScenarioProcessStepAlternativeComponent.ExampleScenarioProcessStepAlternativeOptionComponentStep.ExampleScenarioProcessStepOperationComponentContainedInstance
title: Each resource instance used by the initiator

ProductShelfLife.specialPrecautionsForStorage
type: ObjectProperty
comment: Special precautions for storage, if any, can be specified using an appropriate controlled vocabulary The controlled term and the controlled term identifier shall be specified.
domain: ProductShelfLife
range: CodeableConcept
title: Special precautions for storage, if any, can be specified using an appropriate controlled vocabulary The controlled term and the controlled term identifier shall be specified

CommunicationRequest
type: Class
comment: A request to convey information; e.g. the CDS system proposes that an alert be sent to a responsible provider, the CDS system proposes that the public health agency be notified about a reportable condition.
subclass of: workflow.order
subclass of: DomainResource
subclass of: Restriction
  all values from: Reference
  on property: CommunicationRequest.reasonReference
subclass of:
  union of: Restriction
    all values from: dateTime
    max cardinality: 1
    on property: CommunicationRequest.occurrenceDateTime
  union of: Restriction
    all values from: Period
    max cardinality: 1
    on property: CommunicationRequest.occurrencePeriod
subclass of: Restriction
  all values from: Reference
  on property: CommunicationRequest.replaces
subclass of: Restriction
  all values from: Reference
  on property: CommunicationRequest.about
subclass of: Restriction
  all values from: Reference
  max cardinality: 1
  on property: CommunicationRequest.subject
subclass of: Restriction
  all values from: boolean
  max cardinality: 1
  on property: CommunicationRequest.doNotPerform
subclass of: Restriction
  cardinality: 1
  on property: CommunicationRequest.status
  some values from: code
subclass of: Restriction
  all values from: Reference
  max cardinality: 1
  on property: CommunicationRequest.requester
subclass of: Restriction
  all values from: Identifier
  max cardinality: 1
  on property: CommunicationRequest.groupIdentifier
subclass of: Restriction
  all values from: Annotation
  on property: CommunicationRequest.note
subclass of: Restriction
  all values from: Reference
  max cardinality: 1
  on property: CommunicationRequest.context
subclass of: Restriction
  all values from: CodeableConcept
  max cardinality: 1
  on property: CommunicationRequest.statusReason
subclass of: Restriction
  all values from: Identifier
  on property: CommunicationRequest.identifier
subclass of: Restriction
  all values from: dateTime
  max cardinality: 1
  on property: CommunicationRequest.authoredOn
subclass of: Restriction
  all values from: CommunicationRequestPayloadComponent
  on property: CommunicationRequest.payload
subclass of: Restriction
  all values from: Reference
  max cardinality: 1
  on property: CommunicationRequest.sender
subclass of: Restriction
  all values from: CodeableConcept
  on property: CommunicationRequest.medium
subclass of: Restriction
  all values from: CodeableConcept
  on property: CommunicationRequest.category
subclass of: Restriction
  all values from: Reference
  on property: CommunicationRequest.basedOn
subclass of: Restriction
  all values from: code
  max cardinality: 1
  on property: CommunicationRequest.priority
subclass of: Restriction
  all values from: Reference
  on property: CommunicationRequest.recipient
subclass of: Restriction
  all values from: CodeableConcept
  on property: CommunicationRequest.reasonCode

CodeSystem.concept.designation.language
type: ObjectProperty
comment: The language this designation is defined for.
domain: CodeSystem.ConceptDefinitionComponent.ConceptDefinitionDesignationComponent
range: code
title: Human language of the designation

MedicinalProductAuthorization.statusDate
type: ObjectProperty
comment: The date at which the given status has become applicable.
domain: MedicinalProductAuthorization
range: dateTime
title: The date at which the given status has become applicable

MedicinalProductDeviceSpec.sterilisationRequirement
type: ObjectProperty
comment: Whether the device must be sterilised before use.
domain: MedicinalProductDeviceSpec
range: CodeableConcept
title: Whether the device must be sterilised before use

Task.groupIdentifier
type: ObjectProperty
comment: An identifier that links together multiple tasks and other requests that were created in the same context.
domain: Task
range: Identifier
title: Requisition or grouper id

Condition.bodySite
type: ObjectProperty
comment: The anatomical location where this condition manifests itself.
domain: Condition
range: CodeableConcept
title: Anatomical location, if relevant

Slot.specialty
type: ObjectProperty
comment: The specialty of a practitioner that would be required to perform the service requested in this appointment.
domain: Slot
range: CodeableConcept
sub property of: class
title: The specialty of a practitioner that would be required to perform the service requested in this appointment

Contract.author
type: ObjectProperty
comment: The individual or organization that authored the Contract definition, derivative, or instance in any legal state.
domain: Contract
range: Reference
title: Source of Contract

Coding
type: Class
comment: A reference to a code defined by a terminology system.
subclass of: Element
subclass of: Restriction
  all values from: boolean
  max cardinality: 1
  on property: Coding.userSelected
subclass of: Restriction
  all values from: uri
  max cardinality: 1
  on property: Coding.system
subclass of: Restriction
  all values from: string
  max cardinality: 1
  on property: Coding.version
subclass of: Restriction
  all values from: code
  max cardinality: 1
  on property: Coding.code
subclass of: Restriction
  all values from: string
  max cardinality: 1
  on property: Coding.display
title: A reference to a code defined by a terminology system

MedicinalProduct.name.countryLanguage.country
type: ObjectProperty
comment: Country code for where this name applies.
domain: MedicinalProductNameComponent.MedicinalProductNameCountryLanguageComponent
range: CodeableConcept
title: Country code for where this name applies

ElementDefinition.constraint.key
type: ObjectProperty
comment: Allows identification of which elements have their cardinalities impacted by the constraint. Will not be referenced for constraints that do not affect cardinality.
domain: ElementDefinitionConstraintComponent
range: id
title: Target of 'condition' reference above

PlanDefinition.goal.target.detail
type: ObjectProperty

VerificationResult.validator.identityCertificate
type: ObjectProperty
comment: A digital identity certificate associated with the validator.
domain: VerificationResultValidatorComponent
range: string
title: A digital identity certificate associated with the validator

MedicationKnowledge.regulatory
type: ObjectProperty
comment: Regulatory information about a medication.
domain: MedicationKnowledge
range: MedicationKnowledgeRegulatoryComponent
title: Regulatory information about a medication

Expression.expression
type: ObjectProperty
comment: An expression in the specified language that returns a value.
domain: Expression
range: string
title: Expression in specified language

ImplementationGuide.definition.parameter
type: ObjectProperty
comment: Defines how IG is built by tools.
domain: ImplementationGuideDefinitionComponent
range: ImplementationGuideDefinitionComponent.ImplementationGuideDefinitionParameterComponent
title: Defines how IG is built by tools

ExplanationOfBenefit.addItem.net
type: ObjectProperty
comment: The quantity times the unit price for an additional service or product or charge. For example, the formula: unit Quantity * unit Price (Cost per Point) * factor Number * points = net Amount. Quantity, factor and points are assumed to be 1 if not supplied.
domain: ExplanationOfBenefit.AddedItemComponent
range: Money
title: Total item cost

ServiceRequest.status
type: ObjectProperty
comment: The status of the order.
domain: ServiceRequest
range: code
sub property of: status
title: draft | active | suspended | completed | entered-in-error | cancelled

TerminologyCapabilities.date
type: ObjectProperty
comment: The date (and optionally time) when the terminology capabilities was published. The date must change when the business version changes and it must change if the status code changes. In addition, it should change when the substantive content of the terminology capabilities changes.
domain: TerminologyCapabilities
range: dateTime
sub property of: when.recorded
title: Date last changed

GraphDefinition.link.target.link.target.compartment.expression
type: ObjectProperty
comment: Custom rule, as a FHIRPath expression.
domain: GraphDefinitionLinkComponent.GraphDefinitionLinkTargetComponentLink.GraphDefinitionLinkTargetComponent.GraphDefinitionLinkTargetCompartmentComponent
range: string
title: Custom rule, as a FHIRPath expression

Device.udiCarrier.carrierHRF
type: ObjectProperty
comment: The full UDI carrier as the human readable form (HRF) representation of the barcode string as printed on the packaging of the device.
domain: DeviceUdiCarrierComponent
range: string
title: UDI Human Readable Barcode String

MessageHeader.source.software
type: ObjectProperty
comment: May include configuration or other information useful in debugging.
domain: MessageHeader.MessageSourceComponent
range: string
title: Name of software running the system

MedicationDispense.substitution.reason
type: ObjectProperty
comment: Indicates the reason for the substitution (or lack of substitution) from what was prescribed.
domain: MedicationDispenseSubstitutionComponent
range: CodeableConcept
title: Why was substitution made

TestScript.rule
type: ObjectProperty
comment: Assert rule to be used in one or more asserts within the test script.
domain: TestScript
range: TestScriptRuleComponent
title: Assert rule used within the test script

ElementDefinition.meaningWhenMissing
type: ObjectProperty
comment: The Implicit meaning that is to be understood when this element is missing (e.g. 'when this element is missing, the period is ongoing').
domain: ElementDefinition
range: markdown
title: Implicit meaning when this element is missing

TestScript.setup.action.assert.rule.param
type: ObjectProperty
comment: Each rule template can take one or more parameters for rule evaluation.
domain: TestScriptSetupComponent.SetupActionComponent.SetupActionAssertComponent.ActionAssertRuleComponent
range: TestScriptSetupComponent.SetupActionComponent.SetupActionAssertComponent.ActionAssertRuleComponent.ActionAssertRuleParamComponent
title: Rule parameter template

Device.udiCarrier
type: ObjectProperty
comment: Unique device identifier (UDI) assigned to device label or package. Note that the Device may include multiple udiCarriers as it either may include just the udiCarrier for the jurisdiction it is sold, or for multiple jurisdictions it could have been sold.
domain: Device
range: DeviceUdiCarrierComponent
sub property of: id
title: Unique Device Identifier (UDI) Barcode string

DeviceRequest.insurance
type: ObjectProperty
comment: Insurance plans, coverage extensions, pre-authorizations and/or pre-determinations that may be required for delivering the requested service.
domain: DeviceRequest
range: Reference
title: Associated insurance coverage

ConceptMap.useContext
type: ObjectProperty
comment: The content was developed with a focus and intent of supporting the contexts that are listed. These terms may be used to assist with indexing and searching for appropriate concept map instances.
domain: ConceptMap
range: UsageContext
title: The context that the content is intended to support

Account.description
type: ObjectProperty
comment: Provides additional information about what the account tracks and how it is used.
domain: Account
range: string
title: Explanation of purpose/use

Location.address
type: ObjectProperty
comment: Physical location.
domain: Location
range: Address
title: Physical location

ItemInstance.currentSWVersion
type: ObjectProperty
comment: The Software version associated with the device, typically only used for devices with embedded software or firmware.
domain: ItemInstance
range: string
title: The Software version associated with the device

SampledData.lowerLimit
type: ObjectProperty
comment: The lower limit of detection of the measured points. This is needed if any of the data points have the value "L" (lower than detection limit).
domain: SampledData
range: decimal
title: Lower limit of detection

FamilyMemberHistory.condition.onsetRange
type: ObjectProperty
domain: FamilyMemberHistoryConditionComponent
range: Range
sub property of: FamilyMemberHistory.condition.onset

ProdCharacteristic.color
type: ObjectProperty
comment: Where applicable, the color can be specified An appropriate controlled vocabulary shall be used The term and the term identifier shall be used.
domain: ProdCharacteristic
range: string
title: Where applicable, the color can be specified An appropriate controlled vocabulary shall be used The term and the term identifier shall be used

Quantity.code
type: ObjectProperty
comment: A computer processable form of the unit in some unit representation system.
domain: Quantity
range: code
title: Coded form of the unit

CodeSystem.filter.value
type: ObjectProperty
comment: A description of what the value for the filter should be.
domain: CodeSystemFilterComponent
range: string
title: What to use for the value

DataRequirement.codeFilter
type: ObjectProperty
comment: Code filters specify additional constraints on the data, specifying the value set of interest for a particular element of the data. Each code filter defines an additional constraint on the data, i.e. code filters are AND'ed, not OR'ed.
domain: DataRequirement
range: DataRequirementCodeFilterComponent
title: What codes are expected

DeviceRequest.occurrencePeriod
type: ObjectProperty
domain: DeviceRequest
range: Period
sub property of: DeviceRequest.occurrence

Procedure.instantiatesUri
type: ObjectProperty
comment: The URL pointing to an externally maintained protocol, guideline, orderset or other definition that is adhered to in whole or in part by this Procedure.
domain: Procedure
range: uri
title: Instantiates external protocol or definition

ExplanationOfBenefit.item.adjudication
type: ObjectProperty
comment: The adjudication results.
domain: ExplanationOfBenefit.ItemComponent
range: ExplanationOfBenefit.ItemComponent.AdjudicationComponent
title: Adjudication details

Basic
type: Class
comment: Basic is used for handling concepts not yet defined in FHIR, narrative-only resources that don't map to an existing resource, and custom resources not appropriate for inclusion in the FHIR specification.
subclass of: DomainResource
subclass of: infrastructure.structure
subclass of: Restriction
  all values from: Reference
  max cardinality: 1
  on property: Basic.author
subclass of: Restriction
  all values from: Identifier
  on property: Basic.identifier
subclass of: Restriction
  all values from: Reference
  max cardinality: 1
  on property: Basic.subject
subclass of: Restriction
  all values from: date
  max cardinality: 1
  on property: Basic.created
subclass of: Restriction
  cardinality: 1
  on property: Basic.code
  some values from: CodeableConcept

ProdCharacteristic.scoring
type: ObjectProperty
comment: Where applicable, the scoring can be specified An appropriate controlled vocabulary shall be used The term and the term identifier shall be used.
domain: ProdCharacteristic
range: CodeableConcept
title: Where applicable, the scoring can be specified An appropriate controlled vocabulary shall be used The term and the term identifier shall be used

DeviceSpecializationComponent
type: Class
comment: The capabilities supported on a device, the standards to which the device conforms for a particular purpose, and used for the communication.
subclass of: BackboneElement
subclass of: Restriction
  all values from: string
  max cardinality: 1
  on property: Device.specialization.version
subclass of: Restriction
  cardinality: 1
  on property: Device.specialization.systemType
  some values from: CodeableConcept

CarePlan.description
type: ObjectProperty
comment: A description of the scope and nature of the plan.
domain: CarePlan
range: string
sub property of: what
title: Summary of nature of plan

Provenance.entity.role
type: ObjectProperty
comment: How the entity was used during the activity.
domain: ProvenanceEntityComponent
range: code
title: derivation | revision | quotation | source | removal

Attachment
type: Class
comment: For referring to data content defined in other formats.
subclass of: Element
subclass of: Restriction
  all values from: code
  max cardinality: 1
  on property: Attachment.contentType
subclass of: Restriction
  all values from: base64Binary
  max cardinality: 1
  on property: Attachment.data
subclass of: Restriction
  all values from: base64Binary
  max cardinality: 1
  on property: Attachment.hash
subclass of: Restriction
  all values from: url
  max cardinality: 1
  on property: Attachment.url
subclass of: Restriction
  all values from: string
  max cardinality: 1
  on property: Attachment.title
subclass of: Restriction
  all values from: dateTime
  max cardinality: 1
  on property: Attachment.creation
subclass of: Restriction
  all values from: unsignedInt
  max cardinality: 1
  on property: Attachment.size
subclass of: Restriction
  all values from: code
  max cardinality: 1
  on property: Attachment.language
title: Content in a format defined elsewhere

CapabilityStatement.software
type: ObjectProperty
comment: Software that is covered by this capability statement. It is used when the capability statement describes the capabilities of a particular software version, independent of an installation.
domain: CapabilityStatement
range: CapabilityStatementSoftwareComponent
title: Software that is covered by this capability statement

EpisodeOfCare.diagnosis.rank
type: ObjectProperty
comment: Ranking of the diagnosis (for each role type).
domain: EpisodeOfCare.DiagnosisComponent
range: positiveInt
title: Ranking of the diagnosis (for each role type)

CompartmentDefinition.code
type: ObjectProperty
comment: Which compartment this definition describes.
domain: CompartmentDefinition
range: code
title: Patient | Encounter | RelatedPerson | Practitioner | Device

Condition.clinicalStatus
type: ObjectProperty
comment: The clinical status of the condition.
domain: Condition
range: CodeableConcept
sub property of: status
title: active | recurrence | relapse | well-controlled | poorly-controlled | inactive | remission | resolved

DeviceRequest.reasonReference
type: ObjectProperty
comment: Reason or justification for the use of this device.
domain: DeviceRequest
range: Reference
sub property of: why
title: Linked Reason for request

Claim.diagnosis.type
type: ObjectProperty
comment: The type of the Diagnosis, for example: admitting, primary, secondary, discharge.
domain: Claim.DiagnosisComponent
range: CodeableConcept
title: Timing or nature of the diagnosis

ExplanationOfBenefit.careTeam.provider
type: ObjectProperty
comment: The members of the team who provided the overall service.
domain: ExplanationOfBenefit.CareTeamComponent
range: Reference
sub property of: who.actor
title: Member of the Care Team

Contract.term.group.asset.valuedItem.unitPrice
type: ObjectProperty
comment: A Contract Valued Item unit valuation measure.
domain: Contract.TermComponentTerm.ContractAssetComponent.ValuedItemComponent
range: Money
sub property of: what
title: Contract Valued Item fee, charge, or cost

QuestionnaireItemComponent.QuestionnaireItemAnswerOptionComponent
type: Class
comment: One of the permitted answers for a "choice" or "open-choice" question.
subclass of: BackboneElement
subclass of: Restriction
  all values from: boolean
  max cardinality: 1
  on property: Questionnaire.item.answerOption.initialSelected
subclass of:
  union of: Restriction
    cardinality: 1
    on property: Questionnaire.item.answerOption.valueInteger
    some values from: integer
  union of: Restriction
    cardinality: 1
    on property: Questionnaire.item.answerOption.valueDate
    some values from: date
  union of: Restriction
    cardinality: 1
    on property: Questionnaire.item.answerOption.valueTime
    some values from: time
  union of: Restriction
    cardinality: 1
    on property: Questionnaire.item.answerOption.valueString
    some values from: string
  union of: Restriction
    cardinality: 1
    on property: Questionnaire.item.answerOption.valueCoding
    some values from: Coding
  union of: Restriction
    cardinality: 1
    on property: Questionnaire.item.answerOption.valueReference
    some values from: Reference

Dosage.site
type: ObjectProperty
comment: Body site to administer to.
domain: Dosage
range: CodeableConcept
title: Body site to administer to

ConceptMap.date
type: ObjectProperty
comment: The date (and optionally time) when the concept map was published. The date must change when the business version changes and it must change if the status code changes. In addition, it should change when the substantive content of the concept map changes.
domain: ConceptMap
range: dateTime
sub property of: when.recorded
title: Date last changed

Ratio.denominator
type: ObjectProperty
comment: The value of the denominator.
domain: Ratio
range: Quantity
title: Denominator value

Invoice.lineItem.chargeItem
type: ObjectProperty

Account.coverage.priority
type: ObjectProperty
comment: The priority of the coverage in the context of this account.
domain: Account.CoverageComponent
range: positiveInt
title: The priority of the coverage in the context of this account

ServiceRequest.basedOn
type: ObjectProperty
comment: Plan/proposal/order fulfilled by this request.
domain: ServiceRequest
range: Reference
title: What request fulfills

Location.hoursOfOperation
type: ObjectProperty
comment: What days/times during a week is this location usually open.
domain: Location
range: LocationHoursOfOperationComponent
title: What days/times during a week is this location usually open

PlanDefinition.action.action.trigger
type: ObjectProperty
comment: A description of when the action should be triggered.
domain: PlanDefinitionActionComponentAction
range: TriggerDefinition
title: When the action should be triggered

ExplanationOfBenefit.item.serviced
type: ObjectProperty

MedicationRequest.performerType
type: ObjectProperty
comment: Indicates the type of performer of the administration of the medication.
domain: MedicationRequest
range: CodeableConcept
title: Desired kind of performer of the medication administration

ConceptMap.group.element.display
type: ObjectProperty
comment: The display for the code. The display is only provided to help editors when editing the concept map.
domain: ConceptMapGroupComponent.SourceElementComponent
range: string
title: Display for the code

GraphDefinitionLinkComponent.GraphDefinitionLinkTargetComponentLink.GraphDefinitionLinkTargetComponent
type: Class
comment: Potential target for the link.
subclass of: BackboneElement
subclass of: Restriction
  all values from: GraphDefinitionLinkComponent.GraphDefinitionLinkTargetComponentLink.GraphDefinitionLinkTargetComponentLink
  on property: GraphDefinition.link.target.link.target.link
subclass of: Restriction
  all values from: GraphDefinitionLinkComponent.GraphDefinitionLinkTargetComponentLink.GraphDefinitionLinkTargetComponent.GraphDefinitionLinkTargetCompartmentComponent
  on property: GraphDefinition.link.target.link.target.compartment
subclass of: Restriction
  all values from: canonical
  max cardinality: 1
  on property: GraphDefinition.link.target.link.target.profile
subclass of: Restriction
  all values from: string
  max cardinality: 1
  on property: GraphDefinition.link.target.link.target.params
subclass of: Restriction
  cardinality: 1
  on property: GraphDefinition.link.target.link.target.type
  some values from: code

CapabilityStatement.copyright
type: ObjectProperty
comment: A copyright statement relating to the capability statement and/or its contents. Copyright statements are generally legal restrictions on the use and publishing of the capability statement.
domain: CapabilityStatement
range: markdown
title: Use and/or publishing restrictions

Condition.stage.summary
type: ObjectProperty
comment: A simple summary of the stage such as "Stage 3". The determination of the stage is disease-specific.
domain: ConditionStageComponent
range: CodeableConcept
title: Simple summary (disease specific)

ImmunizationEvaluation.doseStatusReason
type: ObjectProperty
comment: Provides an explanation as to why the vaccine administration event is valid or not relative to the published recommendations.
domain: ImmunizationEvaluation
range: CodeableConcept
title: Reason for the dose status

MedicationRequest.statusReason
type: ObjectProperty
comment: Captures the reason for the current state of the MedicationRequest.
domain: MedicationRequest
range: CodeableConcept
title: Reason for current status

Measure.experimental
type: ObjectProperty
comment: A Boolean value to indicate that this measure is authored for testing purposes (or education/evaluation/marketing) and is not intended to be used for genuine usage.
domain: Measure
range: boolean
sub property of: class
title: For testing purposes, not real usage

ServiceRequest.quantity
type: ObjectProperty

RiskAssessment.occurrenceDateTime
type: ObjectProperty
domain: RiskAssessment
range: dateTime
sub property of: RiskAssessment.occurrence

MedicinalProductDeviceSpec.batchIdentifier
type: ObjectProperty
comment: Batch number or expiry date of a device.
domain: MedicinalProductDeviceSpec
range: Identifier
title: Batch number or expiry date of a device

OrganizationAffiliation.network
type: ObjectProperty
comment: Health insurance provider network in which the participatingOrganization provides the role's services (if defined) at the indicated locations (if defined).
domain: OrganizationAffiliation
range: Reference
title: Health insurance provider network in which the participatingOrganization provides the role's services (if defined) at the indicated locations (if defined)

CodeSystem.count
type: ObjectProperty
comment: The total number of concepts defined by the code system. Where the code system has a compositional grammar, the basis of this count is defined by the system steward.
domain: CodeSystem
range: unsignedInt
title: Total concepts in the code system

Parameters.parameter.resource
type: ObjectProperty
comment: If the parameter is a whole resource.
domain: ParametersParameterComponent
range: Resource
title: If parameter is a whole resource

VisionPrescription.dispense.axis
type: ObjectProperty
comment: Adjustment for astigmatism measured in integer degrees.
domain: VisionPrescriptionDispenseComponent
range: integer
title: Lens axis

CapabilityStatement.rest.resource.documentation
type: ObjectProperty
comment: Additional information about the resource type used by the system.
domain: CapabilityStatementRestComponent.CapabilityStatementRestResourceComponent
range: markdown
title: Additional information about the use of the resource type

Questionnaire.item.item.answerOption.valueTime
type: ObjectProperty
domain: QuestionnaireItemComponentItem.QuestionnaireItemAnswerOptionComponent
range: time
sub property of: Questionnaire.item.item.answerOption.value

Account.guarantor.onHold
type: ObjectProperty
comment: A guarantor may be placed on credit hold or otherwise have their role temporarily suspended.
domain: Account.GuarantorComponent
range: boolean
title: Credit or other hold applied

Composition.section.text
type: ObjectProperty
comment: A human-readable narrative that contains the attested content of the section, used to represent the content of the resource to a human. The narrative need not encode all the structured data, but is required to contain sufficient detail to make it "clinically safe" for a human to just read the narrative.
domain: Composition.SectionComponent
range: Narrative
title: Text summary of the section, for human interpretation

Contract.TermComponent.ContractOfferComponent.AnswerComponent
type: Class
comment: Response to offer text.
subclass of: BackboneElement
subclass of:
  union of: Restriction
    cardinality: 1
    on property: Contract.term.offer.answer.valueBoolean
    some values from: boolean
  union of: Restriction
    cardinality: 1
    on property: Contract.term.offer.answer.valueDecimal
    some values from: decimal
  union of: Restriction
    cardinality: 1
    on property: Contract.term.offer.answer.valueInteger
    some values from: integer
  union of: Restriction
    cardinality: 1
    on property: Contract.term.offer.answer.valueDate
    some values from: date
  union of: Restriction
    cardinality: 1
    on property: Contract.term.offer.answer.valueDateTime
    some values from: dateTime
  union of: Restriction
    cardinality: 1
    on property: Contract.term.offer.answer.valueTime
    some values from: time
  union of: Restriction
    cardinality: 1
    on property: Contract.term.offer.answer.valueString
    some values from: string
  union of: Restriction
    cardinality: 1
    on property: Contract.term.offer.answer.valueUri
    some values from: uri
  union of: Restriction
    cardinality: 1
    on property: Contract.term.offer.answer.valueAttachment
    some values from: Attachment
  union of: Restriction
    cardinality: 1
    on property: Contract.term.offer.answer.valueCoding
    some values from: Coding
  union of: Restriction
    cardinality: 1
    on property: Contract.term.offer.answer.valueQuantity
    some values from: Quantity
  union of: Restriction
    cardinality: 1
    on property: Contract.term.offer.answer.valueReference
    some values from: Reference

OperationDefinition.parameter.binding.valueSet
type: ObjectProperty
comment: Points to the value set or external definition (e.g. implicit value set) that identifies the set of codes to be used.
domain: OperationDefinitionParameterComponent.OperationDefinitionParameterBindingComponent
range: canonical
title: Source of value set

Communication.statusReason
type: ObjectProperty
comment: Captures the reason for the current state of the Communication.
domain: Communication
range: CodeableConcept
title: Reason for current status

TestScript.test.action.assert.rule.param.name
type: ObjectProperty
comment: Descriptive name for this parameter that matches the external assert rule parameter name.
domain: TestScriptTestComponent.TestActionComponentAssert.ActionAssertRuleComponent.ActionAssertRuleParamComponent
range: string
title: Parameter name matching external assert rule parameter

SpecimenDefinition.specimenToLab.containerAdditive.additiveReference
type: ObjectProperty
domain: SpecimenDefinitionSpecimenToLabComponent.SpecimenDefinitionSpecimenToLabContainerAdditiveComponent
range: Reference
sub property of: SpecimenDefinition.specimenToLab.containerAdditive.additive

MedicinalProductClinicalsContraindicationComponentTherapeuticIndicationPopulation
type: Class
comment: The population group to which this applies.
subclass of: BackboneElement
subclass of: Restriction
  all values from: CodeableConcept
  max cardinality: 1
  on property: MedicinalProductClinicals.contraindication.therapeuticIndication.population.physiologicalCondition
subclass of: Restriction
  all values from: CodeableConcept
  max cardinality: 1
  on property: MedicinalProductClinicals.contraindication.therapeuticIndication.population.race
subclass of: Restriction
  all values from: CodeableConcept
  max cardinality: 1
  on property: MedicinalProductClinicals.contraindication.therapeuticIndication.population.gender
subclass of:
  union of: Restriction
    all values from: Range
    max cardinality: 1
    on property: MedicinalProductClinicals.contraindication.therapeuticIndication.population.ageRange
  union of: Restriction
    all values from: CodeableConcept
    max cardinality: 1
    on property: MedicinalProductClinicals.contraindication.therapeuticIndication.population.ageCodeableConcept
title: The population group to which this applies

CapabilityStatement.rest.resource
type: ObjectProperty
comment: A specification of the restful capabilities of the solution for a specific resource type.
domain: CapabilityStatementRestComponent
range: CapabilityStatementRestComponent.CapabilityStatementRestResourceComponent
title: Resource served on the REST interface

ResearchStudy.status
type: ObjectProperty
comment: The current state of the study.
domain: ResearchStudy
range: code
sub property of: status
title: active | administratively-completed | approved | closed-to-accrual | closed-to-accrual-and-intervention | completed | disapproved | in-review | temporarily-closed-to-accrual | temporarily-closed-to-accrual-and-intervention | withdrawn

PlanDefinition.action.input
type: ObjectProperty
comment: Defines input data requirements for the action.
domain: PlanDefinitionActionComponent
range: DataRequirement
title: Input data requirements

EntryDefinition
type: Class
comment: Catalog entries are wrappers that contextualize items included in a catalog.
subclass of: conformance.content
subclass of: DomainResource
subclass of: Restriction
  cardinality: 1
  on property: EntryDefinition.orderable
  some values from: boolean
subclass of: Restriction
  all values from: code
  max cardinality: 1
  on property: EntryDefinition.status
subclass of: Restriction
  cardinality: 1
  on property: EntryDefinition.referencedItem
  some values from: Reference
subclass of: Restriction
  all values from: CodeableConcept
  max cardinality: 1
  on property: EntryDefinition.type
subclass of: Restriction
  all values from: CodeableConcept
  on property: EntryDefinition.additionalCharacteristic
subclass of: Restriction
  all values from: dateTime
  max cardinality: 1
  on property: EntryDefinition.lastUpdated
subclass of: Restriction
  all values from: Identifier
  on property: EntryDefinition.additionalIdentifier
subclass of: Restriction
  all values from: CodeableConcept
  on property: EntryDefinition.classification
subclass of: Restriction
  all values from: Identifier
  on property: EntryDefinition.identifier
subclass of: Restriction
  all values from: Period
  max cardinality: 1
  on property: EntryDefinition.validityPeriod
subclass of: Restriction
  all values from: EntryDefinitionRelatedEntryComponent
  on property: EntryDefinition.relatedEntry
subclass of: Restriction
  all values from: CodeableConcept
  on property: EntryDefinition.additionalClassification

GuidanceResponse.context
type: ObjectProperty
comment: Allows the context of the guidance response to be provided if available. In a service context, this would likely be unavailable.
domain: GuidanceResponse
range: Reference
sub property of: context
title: Encounter or Episode during which the response was returned

TestScript.test.action.operation.encodeRequestUrl
type: ObjectProperty
comment: Whether or not to implicitly send the request url in encoded format. The default is true to match the standard RESTful client behavior. Set to false when communicating with a server that does not support encoded url paths.
domain: TestScriptTestComponent.TestActionComponentOperation
range: boolean
title: Whether or not to send the request url in encoded format

CommunicationRequest.context
type: ObjectProperty
comment: The encounter or episode of care within which the communication request was created.
domain: CommunicationRequest
range: Reference
sub property of: context
title: Encounter or episode leading to message

BiologicallyDerivedProductProcessingComponent
type: Class
comment: Any processing of the product during collection.
subclass of: BackboneElement
subclass of:
  union of: Restriction
    all values from: dateTime
    max cardinality: 1
    on property: BiologicallyDerivedProduct.processing.timeDateTime
  union of: Restriction
    all values from: Period
    max cardinality: 1
    on property: BiologicallyDerivedProduct.processing.timePeriod
subclass of: Restriction
  all values from: Reference
  max cardinality: 1
  on property: BiologicallyDerivedProduct.processing.additive
subclass of: Restriction
  all values from: CodeableConcept
  max cardinality: 1
  on property: BiologicallyDerivedProduct.processing.procedure
subclass of: Restriction
  all values from: string
  max cardinality: 1
  on property: BiologicallyDerivedProduct.processing.description

Questionnaire.description
type: ObjectProperty
comment: A free text natural language description of the questionnaire from a consumer's perspective.
domain: Questionnaire
range: markdown
title: Natural language description of the questionnaire

MedicinalProductClinicals.undesirableEffects.classification
type: ObjectProperty
comment: Classification of the effect.
domain: MedicinalProductClinicalsUndesirableEffectsComponent
range: CodeableConcept
title: Classification of the effect

TerminologyCapabilities.software
type: ObjectProperty
comment: Software that is covered by this terminology capability statement. It is used when the statement describes the capabilities of a particular software version, independent of an installation.
domain: TerminologyCapabilities
range: TerminologyCapabilitiesSoftwareComponent
title: Software that is covered by this terminology capability statement

TestScript.test.action.operation
type: ObjectProperty
comment: An operation would involve a REST request to a server.
domain: TestScriptTestComponent.TestActionComponent
range: TestScriptTestComponent.TestActionComponentOperation
title: The setup operation to perform

Encounter.statusHistory.status
type: ObjectProperty
comment: planned | arrived | triaged | in-progress | onleave | finished | cancelled +.
domain: Encounter.StatusHistoryComponent
range: code
title: planned | arrived | triaged | in-progress | onleave | finished | cancelled +

NutritionOrder.enteralFormula.baseFormulaType
type: ObjectProperty
comment: The type of enteral or infant formula such as an adult standard formula with fiber or a soy-based infant formula.
domain: NutritionOrderEnteralFormulaComponent
range: CodeableConcept
sub property of: what
title: Type of enteral or infant formula

CodeSystem.hierarchyMeaning
type: ObjectProperty
comment: The meaning of the hierarchy of concepts as represnted in this resource.
domain: CodeSystem
range: code
title: grouped-by | is-a | part-of | classified-with

Claim.item.detail.subDetail.unitPrice
type: ObjectProperty
comment: The fee for an addittional service or product or charge.
domain: Claim.ItemComponent.DetailComponent.SubDetailComponent
range: Money
title: Fee, charge or cost per point

UsageContext.value
type: ObjectProperty

ChargeItemDefinition.version
type: ObjectProperty
comment: The identifier that is used to identify this version of the charge item definition when it is referenced in a specification, model, design or instance. This is an arbitrary value managed by the charge item definition author and is not expected to be globally unique. For example, it might be a timestamp (e.g. yyyymmdd) if a managed version is not available. There is also no expectation that versions can be placed in a lexicographical sequence. To provide a version consistent with the Decision Support Service specification, use the format Major.Minor.Revision (e.g. 1.0.0). For more information on versioning knowledge assets, refer to the Decision Support Service specification. Note that a version is required for non-experimental active assets.
domain: ChargeItemDefinition
range: string
sub property of: id.version
title: Business version of the charge item definition

MedicinalProductIngredientSpecifiedSubstanceComponent
type: Class
comment: A specified substance that comprises this ingredient.
subclass of: BackboneElement
subclass of: Restriction
  all values from: MedicinalProductIngredientSpecifiedSubstanceComponent.MedicinalProductIngredientSpecifiedSubstanceStrengthComponent
  on property: MedicinalProductIngredient.specifiedSubstance.strength
subclass of: Restriction
  all values from: CodeableConcept
  max cardinality: 1
  on property: MedicinalProductIngredient.specifiedSubstance.confidentiality
subclass of: Restriction
  cardinality: 1
  on property: MedicinalProductIngredient.specifiedSubstance.group
  some values from: CodeableConcept
subclass of: Restriction
  cardinality: 1
  on property: MedicinalProductIngredient.specifiedSubstance.code
  some values from: CodeableConcept

MedicinalProductClinicals.contraindication.therapeuticIndication.undesirableEffects.population.ageRange
type: ObjectProperty
domain: MedicinalProductClinicalsContraindicationComponentTherapeuticIndicationUndesirableEffects.MedicinalProductClinicalsUndesirableEffectsPopulationComponent
range: Range
sub property of: MedicinalProductClinicals.contraindication.therapeuticIndication.undesirableEffects.population.age

MedicinalProductClinicals.contraindication.therapeuticIndication.undesirableEffects.population.physiologicalCondition
type: ObjectProperty
comment: The existing physiological conditions of the specific population to which this applies.
domain: MedicinalProductClinicalsContraindicationComponentTherapeuticIndicationUndesirableEffects.MedicinalProductClinicalsUndesirableEffectsPopulationComponent
range: CodeableConcept
title: The existing physiological conditions of the specific population to which this applies

ElementDefinition.maxValueDateTime
type: ObjectProperty
domain: ElementDefinition
range: dateTime
sub property of: ElementDefinition.maxValue

Slot.appointmentType
type: ObjectProperty
comment: The style of appointment or patient that may be booked in the slot (not service type).
domain: Slot
range: CodeableConcept
sub property of: class
title: The style of appointment or patient that may be booked in the slot (not service type)

Contract.term.group.asset.valuedItem.net
type: ObjectProperty
comment: Expresses the product of the Contract Valued Item unitQuantity and the unitPriceAmt. For example, the formula: unit Quantity * unit Price (Cost per Point) * factor Number * points = net Amount. Quantity, factor and points are assumed to be 1 if not supplied.
domain: Contract.TermComponentTerm.ContractAssetComponent.ValuedItemComponent
range: Money
sub property of: what
title: Total Contract Valued Item Value

CompartmentDefinition.version
type: ObjectProperty
comment: The identifier that is used to identify this version of the compartment definition when it is referenced in a specification, model, design or instance. This is an arbitrary value managed by the compartment definition author and is not expected to be globally unique. For example, it might be a timestamp (e.g. yyyymmdd) if a managed version is not available. There is also no expectation that versions can be placed in a lexicographical sequence.
domain: CompartmentDefinition
range: string
sub property of: id.version
title: Business version of the compartment definition

GraphDefinition.link.target.link.target.params
type: ObjectProperty
comment: A set of parameters to look up.
domain: GraphDefinitionLinkComponent.GraphDefinitionLinkTargetComponentLink.GraphDefinitionLinkTargetComponent
range: string
title: Criteria for reverse lookup

Specimen.processing.timePeriod
type: ObjectProperty
domain: SpecimenProcessingComponent
range: Period
sub property of: Specimen.processing.time

ImplementationGuide.definition.resource
type: ObjectProperty
comment: A resource that is part of the implementation guide. Conformance resources (value set, structure definition, capability statements etc.) are obvious candidates for inclusion, but any kind of resource can be included as an example resource.
domain: ImplementationGuideDefinitionComponent
range: ImplementationGuideDefinitionComponent.ImplementationGuideDefinitionResourceComponent
title: Resource in the implementation guide

PlanDefinition.action.action.textEquivalent
type: ObjectProperty
comment: A text equivalent of the action to be performed. This provides a human-interpretable description of the action when the definition is consumed by a system that might not be capable of interpreting it dynamically.
domain: PlanDefinitionActionComponentAction
range: string
title: Static text equivalent of the action, used if the dynamic aspects cannot be interpreted by the receiving system

NutritionOrder.enteralFormula.baseFormulaProductName
type: ObjectProperty
comment: The product or brand name of the enteral or infant formula product such as "ACME Adult Standard Formula".
domain: NutritionOrderEnteralFormulaComponent
range: string
title: Product or brand name of the enteral or infant formula

MedicationKnowledge.synonym
type: ObjectProperty
comment: Additional names for a medication, for example, the name(s) given to a medication in different countries. For example, acetaminophen and paracetamol or salbutamol and albuterol.
domain: MedicationKnowledge
range: string
title: Additional names for a medication

AuditEvent.agent.network
type: ObjectProperty
comment: Logical network location for application activity, if the activity has a network location.
domain: AuditEventAgentComponent
range: AuditEventAgentComponent.AuditEventAgentNetworkComponent
sub property of: where
title: Logical network location for application activity

Claim.careTeam.sequence
type: ObjectProperty
comment: Sequence of the careTeam which serves to order and provide a link.
domain: Claim.CareTeamComponent
range: positiveInt
title: Number to convey order of careTeam

StructureMap.group.rule.name
type: ObjectProperty
comment: Name of the rule for internal references.
domain: StructureMapGroupComponent.StructureMapGroupRuleComponent
range: id
title: Name of the rule for internal references

TestScript.teardown.action.operation.description
type: ObjectProperty
comment: The description would be used by test engines for tracking and reporting purposes.
domain: TestScriptTeardownComponent.TeardownActionComponentOperation
range: string
title: Tracking/reporting operation description

SubstanceSpecificationSubstanceCodeComponent
type: Class
comment: Codes associated with the substance.
subclass of: BackboneElement
subclass of: Restriction
  all values from: string
  on property: SubstanceSpecification.substanceCode.referenceSource
subclass of: Restriction
  all values from: string
  max cardinality: 1
  on property: SubstanceSpecification.substanceCode.comment
subclass of: Restriction
  all values from: dateTime
  max cardinality: 1
  on property: SubstanceSpecification.substanceCode.statusDate
subclass of: Restriction
  all values from: CodeableConcept
  max cardinality: 1
  on property: SubstanceSpecification.substanceCode.status
subclass of: Restriction
  all values from: CodeableConcept
  max cardinality: 1
  on property: SubstanceSpecification.substanceCode.code

StructureDefinition.snapshot
type: ObjectProperty
comment: A snapshot view is expressed in a standalone form that can be used and interpreted without considering the base StructureDefinition.
domain: StructureDefinition
range: StructureDefinitionSnapshotComponent
title: Snapshot view of the structure

ImagingStudy.series
type: ObjectProperty
comment: Each study has one or more series of images or other content.
domain: ImagingStudy
range: ImagingStudySeriesComponent
title: Each study has one or more series of instances

MedicinalProduct.specialDesignation.date
type: ObjectProperty
comment: Date when the designation was granted.
domain: MedicinalProductSpecialDesignationComponent
range: dateTime
title: Date when the designation was granted

MeasureReport.group.stratifier.stratum.population.code
type: ObjectProperty
comment: The type of the population.
domain: MeasureReportGroupComponent.MeasureReportGroupStratifierComponent.StratifierGroupComponent.StratifierGroupPopulationComponent
range: CodeableConcept
title: initial-population | numerator | numerator-exclusion | denominator | denominator-exclusion | denominator-exception | measure-population | measure-population-exclusion | measure-observation

MedicinalProductAuthorization.procedure
type: ObjectProperty
comment: The regulatory procedure for granting or amending a marketing authorization.
domain: MedicinalProductAuthorization
range: MedicinalProductAuthorizationProcedureComponent
title: The regulatory procedure for granting or amending a marketing authorization

StructureDefinition.context
type: ObjectProperty
comment: Identifies the types of resource or data type elements to which the extension can be applied.
domain: StructureDefinition
range: StructureDefinitionContextComponent
title: If an extension, where it can be used in instances

PractitionerRole.practitioner
type: ObjectProperty
comment: Practitioner that is able to provide the defined services for the organization.
domain: PractitionerRole
range: Reference
title: Practitioner that is able to provide the defined services for the organization

DocumentReference.content.attachment
type: ObjectProperty
comment: The document or URL of the document along with critical metadata to prove content has integrity.
domain: DocumentReferenceContentComponent
range: Attachment
title: Where to access the document

Binary
type: Class
comment: A resource that represents the data of a single raw artifact as digital content accessible in its native format. A Binary resource can contain any content, whether text, image, pdf, zip archive, etc.
subclass of: infrastructure.structure
subclass of: Resource
subclass of: Restriction
  all values from: base64Binary
  max cardinality: 1
  on property: Binary.data
subclass of: Restriction
  all values from: Reference
  max cardinality: 1
  on property: Binary.securityContext
subclass of: Restriction
  cardinality: 1
  on property: Binary.contentType
  some values from: code

MedicinalProductClinicals.contraindication.therapeuticIndication.otherTherapy.medicationReference
type: ObjectProperty
domain: MedicinalProductClinicalsContraindicationComponentTherapeuticIndication.MedicinalProductClinicalsTherapeuticIndicationOtherTherapyComponent
range: Reference
sub property of: MedicinalProductClinicals.contraindication.therapeuticIndication.otherTherapy.medication

PlanDefinition.action.timingDateTime
type: ObjectProperty
domain: PlanDefinitionActionComponent
range: dateTime
sub property of: PlanDefinition.action.timing

GuidanceResponse.moduleCanonical
type: ObjectProperty
domain: GuidanceResponse
range: canonical
sub property of: GuidanceResponse.module

MedicinalProductClinicals.contraindication.therapeuticIndication.otherTherapy.therapyRelationshipType
type: ObjectProperty
comment: The type of relationship between the medicinal product indication or contraindication and another therapy.
domain: MedicinalProductClinicalsContraindicationComponentTherapeuticIndication.MedicinalProductClinicalsTherapeuticIndicationOtherTherapyComponent
range: CodeableConcept
title: The type of relationship between the medicinal product indication or contraindication and another therapy

Location.hoursOfOperation.daysOfWeek
type: ObjectProperty
comment: Indicates which days of the week are available between the start and end Times.
domain: LocationHoursOfOperationComponent
range: code
title: mon | tue | wed | thu | fri | sat | sun

EpisodeOfCare.managingOrganization
type: ObjectProperty
comment: The organization that has assumed the specific responsibilities for the specified duration.
domain: EpisodeOfCare
range: Reference
title: Organization that assumes care

AdverseEvent.date
type: ObjectProperty
comment: The date (and perhaps time) when the adverse event occurred.
domain: AdverseEvent
range: dateTime
sub property of: when.init
title: When the event occurred

SubstanceSpecification.structure.molecularWeight.type
type: ObjectProperty
comment: Type of molecular weight such as exact, average (also known as. number average), weight average.
domain: SubstanceSpecificationStructureComponentMolecularWeight
range: CodeableConcept
title: Type of molecular weight such as exact, average (also known as. number average), weight average

DeviceDefinition.deviceName.type
type: ObjectProperty
comment: The type of deviceName. UDILabelName | UserFriendlyName | PatientReportedName | ManufactureDeviceName | ModelName.
domain: DeviceDefinitionDeviceNameComponent
range: code
sub property of: what
title: udi-label-name | user-friendly-name | patient-reported-name | manufacturer-name | model-name | other

ServiceRequest.identifier
type: ObjectProperty
comment: Identifiers assigned to this order instance by the orderer and/or the receiver and/or order fulfiller.
domain: ServiceRequest
range: Identifier
sub property of: id
title: Identifiers assigned to this order

RiskAssessmentPredictionComponent
type: Class
comment: Describes the expected outcome for the subject.
subclass of: BackboneElement
subclass of:
  union of: Restriction
    all values from: Period
    max cardinality: 1
    on property: RiskAssessment.prediction.whenPeriod
  union of: Restriction
    all values from: Range
    max cardinality: 1
    on property: RiskAssessment.prediction.whenRange
subclass of: Restriction
  all values from: CodeableConcept
  max cardinality: 1
  on property: RiskAssessment.prediction.qualitativeRisk
subclass of:
  union of: Restriction
    all values from: decimal
    max cardinality: 1
    on property: RiskAssessment.prediction.probabilityDecimal
  union of: Restriction
    all values from: Range
    max cardinality: 1
    on property: RiskAssessment.prediction.probabilityRange
subclass of: Restriction
  all values from: CodeableConcept
  max cardinality: 1
  on property: RiskAssessment.prediction.outcome
subclass of: Restriction
  all values from: string
  max cardinality: 1
  on property: RiskAssessment.prediction.rationale
subclass of: Restriction
  all values from: decimal
  max cardinality: 1
  on property: RiskAssessment.prediction.relativeRisk

OperationDefinition.resource
type: ObjectProperty
comment: The types on which this operation can be executed.
domain: OperationDefinition
range: code
title: Types this operation applies to

CommunicationRequest.authoredOn
type: ObjectProperty
comment: For draft requests, indicates the date of initial creation. For requests with other statuses, indicates the date of activation.
domain: CommunicationRequest
range: dateTime
sub property of: when.recorded
title: When request transitioned to being actionable

QuestionnaireResponse.item.answer.valueAttachment
type: ObjectProperty
domain: QuestionnaireResponseItemComponent.QuestionnaireResponseItemAnswerComponent
range: Attachment
sub property of: QuestionnaireResponse.item.answer.value

Claim.item.bodySite
type: ObjectProperty
comment: Physical service site on the patient (limb, tooth, etc.).
domain: Claim.ItemComponent
range: CodeableConcept
title: Service Location

Flag.encounter
type: ObjectProperty
comment: This alert is only relevant during the encounter.
domain: Flag
range: Reference
sub property of: context
title: Alert relevant during encounter

PaymentReconciliation.NotesComponent
type: Class
comment: Suite of notes.
subclass of: BackboneElement
subclass of: Restriction
  all values from: string
  max cardinality: 1
  on property: PaymentReconciliation.processNote.text
subclass of: Restriction
  all values from: code
  max cardinality: 1
  on property: PaymentReconciliation.processNote.type

NutritionOrder.oralDiet.texture
type: ObjectProperty
comment: Class that describes any texture modifications required for the patient to safely consume various types of solid foods.
domain: NutritionOrderOralDietComponent
range: NutritionOrderOralDietComponent.NutritionOrderOralDietTextureComponent
title: Required texture modifications

Contract.term.offer.answer.value
type: ObjectProperty

ActivityDefinition.subject
type: ObjectProperty

ClaimResponse.addItem.factor
type: ObjectProperty
comment: A real number that represents a multiplier used in determining the overall value of services delivered and/or goods received. The concept of a Factor allows for a discount or surcharge multiplier to be applied to a monetary amount.
domain: ClaimResponse.AddedItemComponent
range: decimal
title: Price scaling factor

Immunization.performer.function
type: ObjectProperty
comment: Describes the type of performance (e.g. ordering provider, administering provider, etc.).
domain: ImmunizationPerformerComponent
range: CodeableConcept
title: What type of performance was done

Attachment.size
type: ObjectProperty
comment: The number of bytes of data that make up this attachment (before base64 encoding, if that is done).
domain: Attachment
range: unsignedInt
title: Number of bytes of content (if url provided)

ExampleScenario.process.step.operation.initiator
type: ObjectProperty
comment: Who starts the transaction.
domain: ExampleScenarioProcessComponent.ExampleScenarioProcessStepComponent.ExampleScenarioProcessStepOperationComponent
range: string
title: Who starts the transaction

ExplanationOfBenefit.item.factor
type: ObjectProperty
comment: A real number that represents a multiplier used in determining the overall value of services delivered and/or goods received. The concept of a Factor allows for a discount or surcharge multiplier to be applied to a monetary amount.
domain: ExplanationOfBenefit.ItemComponent
range: decimal
title: Price scaling factor

ConceptMap.target
type: ObjectProperty

Observation.component.valueBoolean
type: ObjectProperty
domain: ObservationComponentComponent
range: boolean
sub property of: Observation.component.value

StructureMap.group.rule.target.listRuleId
type: ObjectProperty
comment: Internal rule reference for shared list items.
domain: StructureMapGroupComponent.StructureMapGroupRuleComponent.StructureMapGroupRuleTargetComponent
range: id
title: Internal rule reference for shared list items

ClaimResponse.addItem.detail.subDetail.unitPrice
type: ObjectProperty
comment: If the item is a node then this is the fee for the product or service, otherwise this is the total of the fees for the children of the group.
domain: ClaimResponse.AddedItemComponent.AddedItemDetailComponent.AddedItemSubDetailComponent
range: Money
title: Fee, charge or cost per point

OperationDefinition.status
type: ObjectProperty
comment: The status of this operation definition. Enables tracking the life-cycle of the content.
domain: OperationDefinition
range: code
sub property of: status
title: draft | active | retired | unknown

ExplanationOfBenefit.payee.type
type: ObjectProperty
comment: Type of Party to be reimbursed: Subscriber, provider, other.
domain: ExplanationOfBenefit.PayeeComponent
range: CodeableConcept
title: Type of party: Subscriber, Provider, other

SequenceStructureVariantComponent
type: Class
comment: Information about chromosome structure variation.
subclass of: BackboneElement
subclass of: Restriction
  all values from: SequenceStructureVariantComponent.SequenceStructureVariantInnerComponent
  max cardinality: 1
  on property: Sequence.structureVariant.inner
subclass of: Restriction
  all values from: SequenceStructureVariantComponent.SequenceStructureVariantOuterComponent
  max cardinality: 1
  on property: Sequence.structureVariant.outer
subclass of: Restriction
  all values from: integer
  max cardinality: 1
  on property: Sequence.structureVariant.length
subclass of: Restriction
  all values from: decimal
  max cardinality: 1
  on property: Sequence.structureVariant.reportedaCGHRatio
subclass of: Restriction
  all values from: string
  max cardinality: 1
  on property: Sequence.structureVariant.precision

CapabilityStatement.status
type: ObjectProperty
comment: The status of this capability statement. Enables tracking the life-cycle of the content.
domain: CapabilityStatement
range: code
sub property of: status
title: draft | active | retired | unknown

CompartmentDefinitionResourceComponent
type: Class
comment: Information about how a resource is related to the compartment.
subclass of: BackboneElement
subclass of: Restriction
  all values from: string
  max cardinality: 1
  on property: CompartmentDefinition.resource.documentation
subclass of: Restriction
  all values from: string
  on property: CompartmentDefinition.resource.param
subclass of: Restriction
  cardinality: 1
  on property: CompartmentDefinition.resource.code
  some values from: code

Contract.term.asset.context.reference
type: ObjectProperty
comment: Asset context reference may include the creator, custodian, or owning Person or Organization (e.g., bank, repository), location held, e.g., building, jurisdiction.
domain: Contract.TermComponent.ContractAssetComponent.AssetContextComponent
range: Reference
title: Creator,custodian or owner

Contract.term.group.securityLabel.category
type: ObjectProperty
comment: Security label privacy tag that species the applicable privacy and security policies governing this term and/or term elements.
domain: Contract.TermComponentTerm.SecurityLabelComponent
range: Coding
title: Applicable Policy

List.status
type: ObjectProperty
comment: Indicates the current state of this list.
domain: List
range: code
sub property of: status
title: current | retired | entered-in-error

TestScript
type: Class
comment: A structured set of tests against a FHIR server or client implementation to determine compliance against the FHIR specification.
subclass of: DomainResource
subclass of: conformance.misc
subclass of: Restriction
  cardinality: 1
  on property: TestScript.url
  some values from: uri
subclass of: Restriction
  all values from: markdown
  max cardinality: 1
  on property: TestScript.copyright
subclass of: Restriction
  all values from: TestScriptRulesetComponent
  on property: TestScript.ruleset
subclass of: Restriction
  cardinality: 1
  on property: TestScript.name
  some values from: string
subclass of: Restriction
  all values from: TestScriptFixtureComponent
  on property: TestScript.fixture
subclass of: Restriction
  all values from: ContactDetail
  on property: TestScript.contact
subclass of: Restriction
  cardinality: 1
  on property: TestScript.status
  some values from: code
subclass of: Restriction
  all values from: UsageContext
  on property: TestScript.useContext
subclass of: Restriction
  all values from: TestScriptTeardownComponent
  max cardinality: 1
  on property: TestScript.teardown
subclass of: Restriction
  all values from: TestScriptSetupComponent
  max cardinality: 1
  on property: TestScript.setup
subclass of: Restriction
  all values from: TestScriptRuleComponent
  on property: TestScript.rule
subclass of: Restriction
  all values from: TestScriptVariableComponent
  on property: TestScript.variable
subclass of: Restriction
  all values from: TestScriptTestComponent
  on property: TestScript.test
subclass of: Restriction
  all values from: TestScriptOriginComponent
  on property: TestScript.origin
subclass of: Restriction
  all values from: markdown
  max cardinality: 1
  on property: TestScript.purpose
subclass of: Restriction
  all values from: string
  max cardinality: 1
  on property: TestScript.publisher
subclass of: Restriction
  all values from: TestScriptDestinationComponent
  on property: TestScript.destination
subclass of: Restriction
  all values from: Identifier
  max cardinality: 1
  on property: TestScript.identifier
subclass of: Restriction
  all values from: string
  max cardinality: 1
  on property: TestScript.version
subclass of: Restriction
  all values from: Reference
  on property: TestScript.profile
subclass of: Restriction
  all values from: markdown
  max cardinality: 1
  on property: TestScript.description
subclass of: Restriction
  all values from: TestScriptMetadataComponent
  max cardinality: 1
  on property: TestScript.metadata
subclass of: Restriction
  all values from: string
  max cardinality: 1
  on property: TestScript.title
subclass of: Restriction
  all values from: CodeableConcept
  on property: TestScript.jurisdiction
subclass of: Restriction
  all values from: dateTime
  max cardinality: 1
  on property: TestScript.date
subclass of: Restriction
  all values from: boolean
  max cardinality: 1
  on property: TestScript.experimental

StructureMapGroupComponent.StructureMapGroupRuleComponentRule.StructureMapGroupRuleTargetComponent
type: Class
comment: Content to create because of this mapping rule.
subclass of: BackboneElement
subclass of: Restriction
  all values from: id
  max cardinality: 1
  on property: StructureMap.group.rule.rule.target.listRuleId
subclass of: Restriction
  all values from: code
  max cardinality: 1
  on property: StructureMap.group.rule.rule.target.transform
subclass of: Restriction
  all values from: StructureMapGroupComponent.StructureMapGroupRuleComponentRule.StructureMapGroupRuleTargetComponent.StructureMapGroupRuleTargetParameterComponent
  on property: StructureMap.group.rule.rule.target.parameter
subclass of: Restriction
  all values from: code
  max cardinality: 1
  on property: StructureMap.group.rule.rule.target.contextType
subclass of: Restriction
  all values from: string
  max cardinality: 1
  on property: StructureMap.group.rule.rule.target.element
subclass of: Restriction
  all values from: id
  max cardinality: 1
  on property: StructureMap.group.rule.rule.target.context
subclass of: Restriction
  all values from: code
  on property: StructureMap.group.rule.rule.target.listMode
subclass of: Restriction
  all values from: id
  max cardinality: 1
  on property: StructureMap.group.rule.rule.target.variable

Composition.section.title
type: ObjectProperty
comment: The label for this particular section. This will be part of the rendered content for the document, and is often used to build a table of contents.
domain: Composition.SectionComponent
range: string
title: Label for section (e.g. for ToC)

PaymentReconciliation.detail.payee
type: ObjectProperty
comment: The organization which is receiving the payment.
domain: PaymentReconciliation.DetailsComponent
range: Reference
sub property of: who.focus
title: Organization which is receiving the payment

Invoice.lineItem.priceComponent
type: ObjectProperty
comment: The price for a ChargeItem may be calculated as a base price with surcharges/deductions that apply in certain conditions. A ChargeItemDefinition resource that defines the prices, factors and conditions that apply to a billing code is currently under developement. The priceComponent element can be used to offer transparency to the recipient of the Invoice of how the prices have been calculated.
domain: InvoiceLineItemComponent
range: InvoiceLineItemComponent.InvoiceLineItemPriceComponentComponent
title: Components of total line item price

HealthcareService.availabilityExceptions
type: ObjectProperty
comment: A description of site availability exceptions, e.g. public holiday availability. Succinctly describing all possible exceptions to normal site availability as details in the available Times and not available Times.
domain: HealthcareService
range: string
title: Description of availability exceptions

Task.identifier
type: ObjectProperty
comment: The business identifier for this task.
domain: Task
range: Identifier
sub property of: id
title: Task Instance Identifier

Task.output
type: ObjectProperty
comment: Outputs produced by the Task.
domain: Task
range: TaskOutputComponent
title: Information produced as part of task

MedicationDispense.supportingInformation
type: ObjectProperty
comment: Additional information that supports the medication being dispensed.
domain: MedicationDispense
range: Reference
sub property of: context
title: Information that supports the dispensing of the medication

ConceptMap.title
type: ObjectProperty
comment: A short, descriptive, user-friendly title for the concept map.
domain: ConceptMap
range: string
title: Name for this concept map (human friendly)

DeviceRequest.status
type: ObjectProperty
comment: The status of the request.
domain: DeviceRequest
range: code
sub property of: status
title: draft | active | suspended | completed | entered-in-error | cancelled

GuidanceResponse.reasonReference
type: ObjectProperty
comment: Indicates the reason the request was initiated. This is typically provided as a parameter to the evaluation and echoed by the service, although for some use cases, such as subscription- or event-based scenarios, it may provide an indication of the cause for the response.
domain: GuidanceResponse
range: Reference
sub property of: why
title: Why guidance is needed

TestScript.origin
type: ObjectProperty
comment: An abstract server used in operations within this test script in the origin element.
domain: TestScript
range: TestScriptOriginComponent
title: An abstract server representing a client or sender in a message exchange

PlanDefinition.goal.target.detailRange
type: ObjectProperty
domain: PlanDefinitionGoalComponent.PlanDefinitionGoalTargetComponent
range: Range
sub property of: PlanDefinition.goal.target.detail

HealthcareService.eligibilityNote
type: ObjectProperty
comment: Describes the eligibility conditions for the service.
domain: HealthcareService
range: string
title: Describes the eligibility conditions for the service

SupplyDelivery.patient
type: ObjectProperty
comment: A link to a resource representing the person whom the delivered item is for.
domain: SupplyDelivery
range: Reference
title: Patient for whom the item is supplied

ExplanationOfBenefit.addItem.adjudication.value
type: ObjectProperty
comment: A non-monetary value for example a percentage. Mutually exclusive to the amount element above.
domain: ExplanationOfBenefit.AddedItemComponentAdjudication
range: decimal
title: Non-monitory value

Consent.provision.provision.dataPeriod
type: ObjectProperty
comment: Clinical or Operational Relevant period of time that bounds the data controlled by this rule.
domain: Consent.provisionComponentProvision
range: Period
title: Timeframe for data controlled by this rule

ExplanationOfBenefit.item.detail.adjudication.category
type: ObjectProperty
comment: Code indicating: Co-Pay, deductable, elegible, benefit, tax, etc.
domain: ExplanationOfBenefit.ItemComponent.DetailComponentAdjudication
range: CodeableConcept
title: Adjudication category such as co-pay, eligible, benefit, etc.

Condition.abatementString
type: ObjectProperty
domain: Condition
range: string
sub property of: Condition.abatement

Contract.term.group.asset.scope
type: ObjectProperty
comment: Differentiates the kind of the asset .
domain: Contract.TermComponentTerm.ContractAssetComponent
range: CodeableConcept
title: Range of asset

MedicinalProductPackaged.packageItem.packageItem.physicalCharacteristics
type: ObjectProperty
comment: Dimensions, color etc.
domain: MedicinalProductPackagedPackageItemComponentPackageItem
range: ProdCharacteristic
title: Dimensions, color etc.

CarePlan.activity.detail.dailyAmount
type: ObjectProperty
comment: Identifies the quantity expected to be consumed in a given day.
domain: CarePlanActivityComponent.CarePlanActivityDetailComponent
range: SimpleQuantity
title: How to consume/day?

Immunization.education
type: ObjectProperty
comment: Educational material presented to the patient (or guardian) at the time of vaccine administration.
domain: Immunization
range: ImmunizationEducationComponent
title: Educational material presented to patient

MedicinalProductIngredientSubstanceComponent
type: Class
comment: The ingredient substance.
subclass of: BackboneElement
subclass of: Restriction
  all values from: MedicinalProductIngredientSubstanceComponentStrength
  on property: MedicinalProductIngredient.substance.strength
subclass of: Restriction
  cardinality: 1
  on property: MedicinalProductIngredient.substance.code
  some values from: CodeableConcept

ElementDefinition.minValueDecimal
type: ObjectProperty
domain: ElementDefinition
range: decimal
sub property of: ElementDefinition.minValue

ConceptMap.group.element.target.equivalence
type: ObjectProperty
comment: The equivalence between the source and target concepts (counting for the dependencies and products). The equivalence is read from target to source (e.g. the target is 'wider' than the source).
domain: ConceptMapGroupComponent.SourceElementComponent.TargetElementComponent
range: code
title: relatedto | equivalent | equal | wider | subsumes | narrower | specializes | inexact | unmatched | disjoint

ClaimResponse.addItem.detail.noteNumber
type: ObjectProperty
comment: A list of note references to the notes provided below.
domain: ClaimResponse.AddedItemComponent.AddedItemDetailComponent
range: positiveInt
title: List of note numbers which apply

CoverageEligibilityResponse
type: Class
comment: This resource provides eligibility and plan details from the processing of an CoverageEligibilityRequest resource.
subclass of: financial.support
subclass of: DomainResource
subclass of: Restriction
  all values from: CoverageEligibilityResponse.InsuranceComponent
  on property: CoverageEligibilityResponse.insurance
subclass of: Restriction
  all values from: Reference
  max cardinality: 1
  on property: CoverageEligibilityResponse.requestProvider
subclass of: Restriction
  all values from: CodeableConcept
  max cardinality: 1
  on property: CoverageEligibilityResponse.form
subclass of: Restriction
  all values from: string
  max cardinality: 1
  on property: CoverageEligibilityResponse.disposition
subclass of:
  union of: Restriction
    all values from: date
    max cardinality: 1
    on property: CoverageEligibilityResponse.servicedDate
  union of: Restriction
    all values from: Period
    max cardinality: 1
    on property: CoverageEligibilityResponse.servicedPeriod
subclass of: Restriction
  all values from: code
  max cardinality: 1
  on property: CoverageEligibilityResponse.status
subclass of: Restriction
  all values from: code
  max cardinality: 1
  on property: CoverageEligibilityResponse.outcome
subclass of: Restriction
  all values from: CoverageEligibilityResponse.ErrorsComponent
  on property: CoverageEligibilityResponse.error
subclass of: Restriction
  all values from: Identifier
  on property: CoverageEligibilityResponse.identifier
subclass of: Restriction
  all values from: Reference
  max cardinality: 1
  on property: CoverageEligibilityResponse.patient
subclass of: Restriction
  all values from: Reference
  max cardinality: 1
  on property: CoverageEligibilityResponse.insurer
subclass of: Restriction
  all values from: dateTime
  max cardinality: 1
  on property: CoverageEligibilityResponse.created
subclass of: Restriction
  on property: CoverageEligibilityResponse.purpose
  some values from: code
subclass of: Restriction
  all values from: string
  max cardinality: 1
  on property: CoverageEligibilityResponse.preAuthRef
subclass of: Restriction
  all values from: Reference
  max cardinality: 1
  on property: CoverageEligibilityResponse.request

OperationDefinitionParameterComponentParameter
type: Class
comment: The parts of a nested Parameter.
subclass of: BackboneElement
subclass of: Restriction
  all values from: canonical
  on property: OperationDefinition.parameter.part.targetProfile
subclass of: Restriction
  all values from: string
  max cardinality: 1
  on property: OperationDefinition.parameter.part.documentation
subclass of: Restriction
  cardinality: 1
  on property: OperationDefinition.parameter.part.min
  some values from: integer
subclass of: Restriction
  all values from: OperationDefinitionParameterComponentParameter.OperationDefinitionParameterBindingComponent
  max cardinality: 1
  on property: OperationDefinition.parameter.part.binding
subclass of: Restriction
  all values from: OperationDefinitionParameterComponentParameterParameter
  on property: OperationDefinition.parameter.part.part
subclass of: Restriction
  all values from: code
  max cardinality: 1
  on property: OperationDefinition.parameter.part.searchType
subclass of: Restriction
  all values from: code
  max cardinality: 1
  on property: OperationDefinition.parameter.part.type
subclass of: Restriction
  cardinality: 1
  on property: OperationDefinition.parameter.part.max
  some values from: string
subclass of: Restriction
  cardinality: 1
  on property: OperationDefinition.parameter.part.name
  some values from: code
subclass of: Restriction
  all values from: OperationDefinitionParameterComponentParameter.OperationDefinitionParameterReferencedFromComponent
  on property: OperationDefinition.parameter.part.referencedFrom
subclass of: Restriction
  cardinality: 1
  on property: OperationDefinition.parameter.part.use
  some values from: code
title: Parts of a nested Parameter

SubstanceReferenceInformation.gene.geneSequenceOrigin
type: ObjectProperty
comment: Todo.
domain: SubstanceReferenceInformationGeneComponent
range: CodeableConcept
title: Todo

StructureMap.group.rule.source.element
type: ObjectProperty
comment: Optional field for this source.
domain: StructureMapGroupComponent.StructureMapGroupRuleComponent.StructureMapGroupRuleSourceComponent
range: string
title: Optional field for this source

ValueSet.compose
type: ObjectProperty
comment: A set of criteria that define the contents of the value set by including or excluding codes selected from the specified code system(s) that the value set draws from. This is also known as the Content Logical Definition (CLD).
domain: ValueSet
range: ValueSetComposeComponent
title: Content logical definition of the value set (CLD)

ImplementationGuide.definition.parameter.code
type: ObjectProperty
comment: apply-business-version | apply-jurisdiction | path-resource | path-pages | path-tx-cache | expansion-parameter | rule-broken-links | generate-xml | generate-json | generate-turtle | html-template.
domain: ImplementationGuideDefinitionComponent.ImplementationGuideDefinitionParameterComponent
range: code
title: apply-business-version | apply-jurisdiction | path-resource | path-pages | path-tx-cache | expansion-parameter | rule-broken-links | generate-xml | generate-json | generate-turtle | html-template

ExplanationOfBenefit.addItem.detail.subDetail.quantity
type: ObjectProperty
comment: The number of repetitions of a service or product.
domain: ExplanationOfBenefit.AddedItemComponent.AddedItemDetailComponent.AddedItemDetailSubDetailComponent
range: SimpleQuantity
title: Count of Products or Services

Contract.term.offer.text
type: ObjectProperty
comment: Human readable form of this Contract Offer.
domain: Contract.TermComponent.ContractOfferComponent
range: string
title: Human readable offer text

MeasureReport.status
type: ObjectProperty
comment: The MeasureReport status. No data will be available until the MeasureReport status is complete.
domain: MeasureReport
range: code
sub property of: status
title: complete | pending | error

OperationDefinition.parameter.part.binding.strength
type: ObjectProperty
comment: Indicates the degree of conformance expectations associated with this binding - that is, the degree to which the provided value set must be adhered to in the instances.
domain: OperationDefinitionParameterComponentParameter.OperationDefinitionParameterBindingComponent
range: code
title: required | extensible | preferred | example

CapabilityStatementMessagingComponent.CapabilityStatementMessagingSupportedMessageComponent
type: Class
comment: References to message definitions for messages this system can send or receive.
subclass of: BackboneElement
subclass of: Restriction
  cardinality: 1
  on property: CapabilityStatement.messaging.supportedMessage.definition
  some values from: canonical
subclass of: Restriction
  cardinality: 1
  on property: CapabilityStatement.messaging.supportedMessage.mode
  some values from: code

ExampleScenarioProcessComponent.ExampleScenarioProcessStepComponentProcess.ExampleScenarioProcessStepComponent.ExampleScenarioProcessStepAlternativeComponent.ExampleScenarioProcessStepAlternativeOptionComponentStep.ExampleScenarioProcessStepOperationComponent
type: Class
comment: Each interaction or action.
subclass of: BackboneElement
subclass of: Restriction
  all values from: string
  max cardinality: 1
  on property: ExampleScenario.process.step.process.step.alternative.option.step.operation.type
subclass of: Restriction
  all values from: boolean
  max cardinality: 1
  on property: ExampleScenario.process.step.process.step.alternative.option.step.operation.initiatorActive
subclass of: Restriction
  all values from: markdown
  max cardinality: 1
  on property: ExampleScenario.process.step.process.step.alternative.option.step.operation.description
subclass of: Restriction
  all values from: ExampleScenarioProcessComponent.ExampleScenarioProcessStepComponentProcess.ExampleScenarioProcessStepComponent.ExampleScenarioProcessStepAlternativeComponent.ExampleScenarioProcessStepAlternativeOptionComponentStep.ExampleScenarioProcessStepOperationComponentContainedInstance
  max cardinality: 1
  on property: ExampleScenario.process.step.process.step.alternative.option.step.operation.request
subclass of: Restriction
  all values from: string
  max cardinality: 1
  on property: ExampleScenario.process.step.process.step.alternative.option.step.operation.receiver
subclass of: Restriction
  all values from: string
  max cardinality: 1
  on property: ExampleScenario.process.step.process.step.alternative.option.step.operation.name
subclass of: Restriction
  all values from: string
  max cardinality: 1
  on property: ExampleScenario.process.step.process.step.alternative.option.step.operation.initiator
subclass of: Restriction
  all values from: ExampleScenarioProcessComponent.ExampleScenarioProcessStepComponentProcess.ExampleScenarioProcessStepComponent.ExampleScenarioProcessStepAlternativeComponent.ExampleScenarioProcessStepAlternativeOptionComponentStep.ExampleScenarioProcessStepOperationComponentContainedInstance
  max cardinality: 1
  on property: ExampleScenario.process.step.process.step.alternative.option.step.operation.response
subclass of: Restriction
  all values from: boolean
  max cardinality: 1
  on property: ExampleScenario.process.step.process.step.alternative.option.step.operation.receiverActive
subclass of: Restriction
  cardinality: 1
  on property: ExampleScenario.process.step.process.step.alternative.option.step.operation.number
  some values from: string

TestScript.setup.action.assert.requestURL
type: ObjectProperty
comment: The value to use in a comparison against the request URL path string.
domain: TestScriptSetupComponent.SetupActionComponent.SetupActionAssertComponent
range: string
title: Request URL comparison value

Sequence.repository.datasetId
type: ObjectProperty
comment: Id of the variant in this external repository. The server will understand how to use this id to call for more info about datasets in external repository.
domain: SequenceRepositoryComponent
range: string
title: Id of the dataset that used to call for dataset in repository

MedicationRequest.supportingInformation
type: ObjectProperty
comment: Include additional information (for example, patient height and weight) that supports the ordering of the medication.
domain: MedicationRequest
range: Reference
sub property of: context
title: Information to support ordering of the medication

Basic.subject
type: ObjectProperty
comment: Identifies the patient, practitioner, device or any other resource that is the "focus" of this resource.
domain: Basic
range: Reference
sub property of: who.focus
title: Identifies the focus of this resource

Bundle.entry.resource
type: ObjectProperty
comment: The Resource for the entry. The purpose/meaning of the resource is determined by the Bundle.type.
domain: BundleEntryComponent
range: Resource
title: A resource in the bundle

DeviceUseStatement.timingPeriod
type: ObjectProperty
domain: DeviceUseStatement
range: Period
sub property of: DeviceUseStatement.timing

DeviceDefinition.property
type: ObjectProperty
comment: The actual configuration settings of a device as it actually operates, e.g., regulation status, time properties.
domain: DeviceDefinition
range: DeviceDefinitionPropertyComponent
title: The actual configuration settings of a device as it actually operates, e.g., regulation status, time properties

ProcessRequest.response
type: ObjectProperty
comment: Reference of a prior response to resource which is the target or subject of this action.
domain: ProcessRequest
range: Reference
title: Reference to the Response resource

MedicationKnowledge.kinetics.halfLifePeriod
type: ObjectProperty
comment: The time required for any specified property (e.g., the concentration of a substance in the body) to decrease by half.
domain: MedicationKnowledgeKineticsComponent
range: Duration
title: Time required for concentration in the body to decrease by half

NutritionOrderOralDietComponent
type: Class
comment: Diet given orally in contrast to enteral (tube) feeding.
subclass of: BackboneElement
subclass of: Restriction
  all values from: NutritionOrderOralDietComponent.NutritionOrderOralDietNutrientComponent
  on property: NutritionOrder.oralDiet.nutrient
subclass of: Restriction
  all values from: CodeableConcept
  on property: NutritionOrder.oralDiet.fluidConsistencyType
subclass of: Restriction
  all values from: string
  max cardinality: 1
  on property: NutritionOrder.oralDiet.instruction
subclass of: Restriction
  all values from: NutritionOrderOralDietComponent.NutritionOrderOralDietTextureComponent
  on property: NutritionOrder.oralDiet.texture
subclass of: Restriction
  all values from: Timing
  on property: NutritionOrder.oralDiet.schedule
subclass of: Restriction
  all values from: CodeableConcept
  on property: NutritionOrder.oralDiet.type

AdverseEvent.suspectEntity.causality.productRelatedness
type: ObjectProperty
comment: AdverseEvent.suspectEntity.causalityProductRelatedness.
domain: AdverseEventSuspectEntityComponent.AdverseEventSuspectEntityCausalityComponent
range: string
title: AdverseEvent.suspectEntity.causalityProductRelatedness

Media.subject
type: ObjectProperty
comment: Who/What this Media is a record of.
domain: Media
range: Reference
sub property of: who.focus
title: Who/What this Media is a record of

Bundle.entry.request.method
type: ObjectProperty
comment: In a transaction or batch, this is the HTTP action to be executed for this entry. In a history bundle, this indicates the HTTP action that occurred.
domain: BundleEntryComponent.BundleEntryRequestComponent
range: code
title: GET | HEAD | POST | PUT | DELETE | PATCH

ExplanationOfBenefit.payment
type: ObjectProperty
comment: Payment details for the claim if the claim has been paid.
domain: ExplanationOfBenefit
range: ExplanationOfBenefit.PaymentComponent
title: Payment Details

Observation.component.valuePeriod
type: ObjectProperty
domain: ObservationComponentComponent
range: Period
sub property of: Observation.component.value

Composition.section.code
type: ObjectProperty
comment: A code identifying the kind of content contained within the section. This must be consistent with the section title.
domain: Composition.SectionComponent
range: CodeableConcept
title: Classification of section (recommended)

Coverage.payor
type: ObjectProperty
comment: The program or plan underwriter or payor including both insurance and non-insurance agreements, such as patient-pay agreements. May provide multiple identifiers such as insurance company identifier or business identifier (BIN number).
domain: Coverage
range: Reference
sub property of: who.author
title: Identifier for the plan or agreement issuer

ProvenanceEntityComponentAgent
type: Class
comment: The entity is attributed to an agent to express the agent's responsibility for that entity, possibly along with other agents. This description can be understood as shorthand for saying that the agent was responsible for the activity which generated the entity.
subclass of: BackboneElement
subclass of: Restriction
  all values from: Reference
  max cardinality: 1
  on property: Provenance.entity.agent.onBehalfOf
subclass of: Restriction
  cardinality: 1
  on property: Provenance.entity.agent.who
  some values from: Reference
subclass of: Restriction
  all values from: CodeableConcept
  on property: Provenance.entity.agent.role
subclass of: Restriction
  all values from: CodeableConcept
  max cardinality: 1
  on property: Provenance.entity.agent.type
title: Entity is attributed to this agent

MedicinalProductClinicals.undesirableEffects.frequencyOfOccurrence
type: ObjectProperty
comment: The frequency of occurrence of the effect.
domain: MedicinalProductClinicalsUndesirableEffectsComponent
range: CodeableConcept
title: The frequency of occurrence of the effect

MedicinalProductDeviceSpec.material.allergenicIndicator
type: ObjectProperty
comment: Whether the substance is a known or suspected allergen.
domain: MedicinalProductDeviceSpecMaterialComponent
range: boolean
title: Whether the substance is a known or suspected allergen

MedicinalProductClinicals.undesirableEffects.population.race
type: ObjectProperty
comment: Race of the specific population.
domain: MedicinalProductClinicalsUndesirableEffectsComponent.MedicinalProductClinicalsUndesirableEffectsPopulationComponent
range: CodeableConcept
title: Race of the specific population

TestScript.setup.action.operation.sourceId
type: ObjectProperty
comment: The id of the fixture used as the body of a PUT or POST request.
domain: TestScriptSetupComponent.SetupActionComponent.SetupActionOperationComponent
range: id
title: Fixture Id of body for PUT and POST requests

TestScriptVariableComponent
type: Class
comment: Variable is set based either on element value in response body or on header field value in the response headers.
subclass of: BackboneElement
subclass of: Restriction
  all values from: id
  max cardinality: 1
  on property: TestScript.variable.sourceId
subclass of: Restriction
  all values from: string
  max cardinality: 1
  on property: TestScript.variable.description
subclass of: Restriction
  all values from: string
  max cardinality: 1
  on property: TestScript.variable.hint
subclass of: Restriction
  all values from: string
  max cardinality: 1
  on property: TestScript.variable.headerField
subclass of: Restriction
  all values from: string
  max cardinality: 1
  on property: TestScript.variable.path
subclass of: Restriction
  all values from: string
  max cardinality: 1
  on property: TestScript.variable.defaultValue
subclass of: Restriction
  all values from: string
  max cardinality: 1
  on property: TestScript.variable.expression
subclass of: Restriction
  cardinality: 1
  on property: TestScript.variable.name
  some values from: string

PlanDefinition.goal.target.measure
type: ObjectProperty
comment: The parameter whose value is to be tracked, e.g. body weight, blood pressure, or hemoglobin A1c level.
domain: PlanDefinitionGoalComponent.PlanDefinitionGoalTargetComponent
range: CodeableConcept
title: The parameter whose value is to be tracked

Questionnaire.item.item.initial.valueReference
type: ObjectProperty
domain: QuestionnaireItemComponentItem.QuestionnaireItemInitialComponent
range: Reference
sub property of: Questionnaire.item.item.initial.value

TerminologyCapabilities.expansion.parameter.name
type: ObjectProperty
comment: Expansion Parameter name.
domain: TerminologyCapabilitiesExpansionComponent.TerminologyCapabilitiesExpansionParameterComponent
range: code
title: Expansion Parameter name

EpisodeOfCare.diagnosis.condition
type: ObjectProperty
comment: A list of conditions/problems/diagnoses that this episode of care is intended to be providing care for.
domain: EpisodeOfCare.DiagnosisComponent
range: Reference
sub property of: what
title: Conditions/problems/diagnoses this episode of care is for

InsurancePlan.coverage.benefit.limit.code
type: ObjectProperty
comment: The specific limit on the benefit.
domain: InsurancePlanCoverageComponent.CoverageBenefitComponent.CoverageBenefitLimitComponent
range: CodeableConcept
title: Benefit limit details

TestScript.test.action.assert.ruleset.rule.ruleId
type: ObjectProperty
comment: Id of the referenced rule within the external ruleset template.
domain: TestScriptTestComponent.TestActionComponentAssert.ActionAssertRulesetComponent.ActionAssertRulesetRuleComponent
range: id
title: Id of referenced rule within the ruleset

SubstanceReferenceInformation.comment
type: ObjectProperty
comment: Todo.
domain: SubstanceReferenceInformation
range: string
title: Todo

ExplanationOfBenefit.addItem.detail.subDetail.adjudication.reason
type: ObjectProperty
comment: Adjudication reason such as limit reached.
domain: ExplanationOfBenefit.AddedItemComponent.AddedItemDetailComponent.AddedItemDetailSubDetailComponentAdjudication
range: CodeableConcept
title: Explanation of Adjudication outcome

Condition.recordedDate
type: ObjectProperty
comment: The recordedDate represents when this particular Condition record was created in the system, which is often a system-generated date.
domain: Condition
range: dateTime
sub property of: when.recorded
title: Date record was first recorded

PlanDefinitionActionComponentAction.PlanDefinitionActionDynamicValueComponent
type: Class
comment: Customizations that should be applied to the statically defined resource. For example, if the dosage of a medication must be computed based on the patient's weight, a customization would be used to specify an expression that calculated the weight, and the path on the resource that would contain the result.
subclass of: BackboneElement
subclass of: Restriction
  all values from: Expression
  max cardinality: 1
  on property: PlanDefinition.action.action.dynamicValue.expression
subclass of: Restriction
  all values from: string
  max cardinality: 1
  on property: PlanDefinition.action.action.dynamicValue.path

Specimen.parent
type: ObjectProperty
comment: Reference to the parent (source) specimen which is used when the specimen was either derived from or a component of another specimen.
domain: Specimen
range: Reference
title: Specimen from which this specimen originated

MedicinalProductIngredient.substance.code
type: ObjectProperty
comment: The ingredient substance.
domain: MedicinalProductIngredientSubstanceComponent
range: CodeableConcept
title: The ingredient substance

SubstanceReferenceInformation.target.target
type: ObjectProperty
comment: Todo.
domain: SubstanceReferenceInformationTargetComponent
range: Identifier
title: Todo

Procedure.performedPeriod
type: ObjectProperty
domain: Procedure
range: Period
sub property of: Procedure.performed

Account.identifier
type: ObjectProperty
comment: Unique identifier used to reference the account. Might or might not be intended for human use (e.g. credit card number).
domain: Account
range: Identifier
sub property of: id
title: Account number

Endpoint.payloadType
type: ObjectProperty
comment: The payload type describes the acceptable content that can be communicated on the endpoint.
domain: Endpoint
range: CodeableConcept
title: The type of content that may be used at this endpoint (e.g. XDS Discharge summaries)

ActivityDefinition.effectivePeriod
type: ObjectProperty
comment: The period during which the activity definition content was or is planned to be in active use.
domain: ActivityDefinition
range: Period
title: When the activity definition is expected to be used

Questionnaire.item.initial.value
type: ObjectProperty

CoverageEligibilityResponse.insurance.item.modifier
type: ObjectProperty
comment: Item typification or modifiers codes, eg for Oral whether the treatment is cosmetic or associated with TMJ, or for medical whether the treatment was outside the clinic or out of office hours.
domain: CoverageEligibilityResponse.InsuranceComponent.ItemsComponent
range: CodeableConcept
title: Service/Product billing modifiers

Observation.component.referenceRange.text
type: ObjectProperty
comment: Text based reference range in an observation which may be used when a quantitative range is not appropriate for an observation. An example would be a reference value of "Negative" or a list or table of "normals".
domain: ObservationComponentComponentReferenceRange
range: string
title: Text based reference range in an observation

ImplementationGuide.dependsOn.uri
type: ObjectProperty
comment: The canonical URL of the Implementation guide for the dependency.
domain: ImplementationGuideDependsOnComponent
range: canonical
title: Identity of the IG that this depends on

TestScript.teardown.action.operation.sourceId
type: ObjectProperty
comment: The id of the fixture used as the body of a PUT or POST request.
domain: TestScriptTeardownComponent.TeardownActionComponentOperation
range: id
title: Fixture Id of body for PUT and POST requests

SubstanceReferenceInformationTargetComponent
type: Class
comment: Todo.
subclass of: BackboneElement
subclass of: Restriction
  all values from: CodeableConcept
  max cardinality: 1
  on property: SubstanceReferenceInformation.target.organism
subclass of: Restriction
  all values from: CodeableConcept
  max cardinality: 1
  on property: SubstanceReferenceInformation.target.interaction
subclass of: Restriction
  all values from: CodeableConcept
  max cardinality: 1
  on property: SubstanceReferenceInformation.target.organismType
subclass of: Restriction
  all values from: Identifier
  max cardinality: 1
  on property: SubstanceReferenceInformation.target.target
subclass of:
  union of: Restriction
    all values from: Quantity
    max cardinality: 1
    on property: SubstanceReferenceInformation.target.amountQuantity
  union of: Restriction
    all values from: Range
    max cardinality: 1
    on property: SubstanceReferenceInformation.target.amountRange
  union of: Restriction
    all values from: string
    max cardinality: 1
    on property: SubstanceReferenceInformation.target.amountString
subclass of: Restriction
  all values from: CodeableConcept
  max cardinality: 1
  on property: SubstanceReferenceInformation.target.amountType
subclass of: Restriction
  all values from: CodeableConcept
  max cardinality: 1
  on property: SubstanceReferenceInformation.target.type
subclass of: Restriction
  all values from: Reference
  on property: SubstanceReferenceInformation.target.source

TestScript.test.name
type: ObjectProperty
comment: The name of this test used for tracking/logging purposes by test engines.
domain: TestScriptTestComponent
range: string
title: Tracking/logging name of this test

PlanDefinition.action.cardinalityBehavior
type: ObjectProperty
comment: Defines whether the action can be selected multiple times.
domain: PlanDefinitionActionComponent
range: code
title: single | multiple

QuestionnaireResponseItemComponent.QuestionnaireResponseItemAnswerComponentItem
type: Class
comment: Nested groups and/or questions found within this particular answer.
subclass of: BackboneElement
subclass of: Restriction
  all values from: string
  max cardinality: 1
  on property: QuestionnaireResponse.item.answer.item.text
subclass of: Restriction
  cardinality: 1
  on property: QuestionnaireResponse.item.answer.item.linkId
  some values from: string
subclass of: Restriction
  all values from: QuestionnaireResponseItemComponent.QuestionnaireResponseItemAnswerComponentItem.QuestionnaireResponseItemAnswerComponent
  on property: QuestionnaireResponse.item.answer.item.answer
subclass of: Restriction
  all values from: uri
  max cardinality: 1
  on property: QuestionnaireResponse.item.answer.item.definition
subclass of: Restriction
  all values from: QuestionnaireResponseItemComponent.QuestionnaireResponseItemAnswerComponentItemItem
  on property: QuestionnaireResponse.item.answer.item.item
title: Nested groups and questions

ExplanationOfBenefit.item.detail.subDetail.net
type: ObjectProperty
comment: The quantity times the unit price for an additional service or product or charge. For example, the formula: unit Quantity * unit Price (Cost per Point) * factor Number * points = net Amount. Quantity, factor and points are assumed to be 1 if not supplied.
domain: ExplanationOfBenefit.ItemComponent.DetailComponent.SubDetailComponent
range: Money
title: Net additional item cost

Contract.term.action.occurrencePeriod
type: ObjectProperty
domain: Contract.TermComponent.ActionComponent
range: Period
sub property of: Contract.term.action.occurrence

BiologicallyDerivedProduct.identifier
type: ObjectProperty
comment: This records identifiers associated with this biologically derived product instance that are defined by business processes and/or used to refer to it when a direct URL reference to the resource itself is not appropriate (e.g. in CDA documents, or in written / printed documentation).
domain: BiologicallyDerivedProduct
range: Identifier
sub property of: id
title: External ids for this item

Specimen.collection.collectedPeriod
type: ObjectProperty
domain: SpecimenCollectionComponent
range: Period
sub property of: Specimen.collection.collected

PractitionerRole.healthcareService
type: ObjectProperty
comment: The list of healthcare services that this worker provides for this role's Organization/Location(s).
domain: PractitionerRole
range: Reference
title: The list of healthcare services that this worker provides for this role's Organization/Location(s)

ResearchSubject.identifier
type: ObjectProperty
comment: Identifiers assigned to this research subject for a study.
domain: ResearchSubject
range: Identifier
sub property of: id
title: Business Identifier for research subject in a study

Questionnaire.item.item.enableWhen.operator
type: ObjectProperty
comment: Specifies the criteria by which the question is enabled.
domain: QuestionnaireItemComponentItem.QuestionnaireItemEnableWhenComponent
range: code
title: exists | = | != | > | < | >= | <=

Composition.status
type: ObjectProperty
comment: The workflow/clinical status of this composition. The status is a marker for the clinical standing of the document.
domain: Composition
range: code
sub property of: status
title: preliminary | final | amended | entered-in-error

Binary.contentType
type: ObjectProperty
comment: MimeType of the binary content represented as a standard MimeType (BCP 13).
domain: Binary
range: code
title: MimeType of the binary content

StructureMap.group.rule.dependent
type: ObjectProperty
comment: Which other rules to apply in the context of this rule.
domain: StructureMapGroupComponent.StructureMapGroupRuleComponent
range: StructureMapGroupComponent.StructureMapGroupRuleComponent.StructureMapGroupRuleDependentComponent
title: Which other rules to apply in the context of this rule

CarePlan.partOf
type: ObjectProperty
comment: A larger care plan of which this particular care plan is a component or step.
domain: CarePlan
range: Reference
title: Part of referenced CarePlan

SubstanceSpecification.substanceName.name
type: ObjectProperty
comment: The actual name.
domain: SubstanceSpecificationSubstanceNameComponent
range: string
title: The actual name

Contract.term.asset.condition
type: ObjectProperty
comment: Description of the quality and completeness of the asset that imay be a factor in its valuation.
domain: Contract.TermComponent.ContractAssetComponent
range: string
title: Quality desctiption of asset

Procedure
type: Class
comment: An action that is or was performed on or for a patient. This can be a physical intervention like an operation, or less invasive like long term services, counseling, or hypnotherapy.
subclass of: clinical.general
subclass of: DomainResource
subclass of: Restriction
  cardinality: 1
  on property: Procedure.subject
  some values from: Reference
subclass of: Restriction
  all values from: Reference
  max cardinality: 1
  on property: Procedure.location
subclass of: Restriction
  all values from: Reference
  on property: Procedure.complicationDetail
subclass of: Restriction
  all values from: CodeableConcept
  on property: Procedure.usedCode
subclass of: Restriction
  all values from: CodeableConcept
  on property: Procedure.bodySite
subclass of: Restriction
  all values from: CodeableConcept
  max cardinality: 1
  on property: Procedure.statusReason
subclass of: Restriction
  all values from: CodeableConcept
  max cardinality: 1
  on property: Procedure.category
subclass of: Restriction
  all values from: Reference
  on property: Procedure.partOf
subclass of: Restriction
  all values from: Reference
  max cardinality: 1
  on property: Procedure.context
subclass of: Restriction
  all values from: Reference
  on property: Procedure.usedReference
subclass of: Restriction
  all values from: Identifier
  on property: Procedure.identifier
subclass of: Restriction
  all values from: CodeableConcept
  max cardinality: 1
  on property: Procedure.code
subclass of: Restriction
  all values from: CodeableConcept
  on property: Procedure.followUp
subclass of: Restriction
  all values from: Annotation
  on property: Procedure.note
subclass of: Restriction
  all values from: Reference
  max cardinality: 1
  on property: Procedure.asserter
subclass of: Restriction
  all values from: Reference
  on property: Procedure.report
subclass of: Restriction
  all values from: Reference
  on property: Procedure.reasonReference
subclass of: Restriction
  all values from: ProcedurePerformerComponent
  on property: Procedure.performer
subclass of: Restriction
  all values from: CodeableConcept
  max cardinality: 1
  on property: Procedure.outcome
subclass of: Restriction
  all values from: canonical
  on property: Procedure.instantiatesCanonical
subclass of: Restriction
  all values from: Reference
  max cardinality: 1
  on property: Procedure.recorder
subclass of:
  union of: Restriction
    all values from: dateTime
    max cardinality: 1
    on property: Procedure.performedDateTime
  union of: Restriction
    all values from: Period
    max cardinality: 1
    on property: Procedure.performedPeriod
  union of: Restriction
    all values from: string
    max cardinality: 1
    on property: Procedure.performedString
  union of: Restriction
    all values from: Age
    max cardinality: 1
    on property: Procedure.performedAge
  union of: Restriction
    all values from: Range
    max cardinality: 1
    on property: Procedure.performedRange
subclass of: Restriction
  all values from: ProcedureFocalDeviceComponent
  on property: Procedure.focalDevice
subclass of: Restriction
  all values from: CodeableConcept
  on property: Procedure.complication
subclass of: Restriction
  all values from: CodeableConcept
  on property: Procedure.reasonCode
subclass of: Restriction
  cardinality: 1
  on property: Procedure.status
  some values from: code
subclass of: Restriction
  all values from: uri
  on property: Procedure.instantiatesUri
subclass of: Restriction
  all values from: Reference
  on property: Procedure.basedOn

PlanDefinition.action.relatedAction.relationship
type: ObjectProperty
comment: The relationship of this action to the related action.
domain: PlanDefinitionActionComponent.PlanDefinitionActionRelatedActionComponent
range: code
title: before-start | before | before-end | concurrent-with-start | concurrent | concurrent-with-end | after-start | after | after-end

TerminologyCapabilities.expansion.parameter.documentation
type: ObjectProperty
comment: Description of support for parameter.
domain: TerminologyCapabilitiesExpansionComponent.TerminologyCapabilitiesExpansionParameterComponent
range: string
title: Description of support for parameter

ExplanationOfBenefit.addItem.detail.subDetail.noteNumber
type: ObjectProperty
comment: A list of note references to the notes provided below.
domain: ExplanationOfBenefit.AddedItemComponent.AddedItemDetailComponent.AddedItemDetailSubDetailComponent
range: positiveInt
title: List of note numbers which apply

Claim.accident.type
type: ObjectProperty
comment: Type of accident: work, auto, etc.
domain: Claim.AccidentComponent
range: CodeableConcept
title: The nature of the accident

Claim.item.modifier
type: ObjectProperty
comment: Item typification or modifiers codes, e.g. for Oral whether the treatment is cosmetic or associated with TMJ, or for medical whether the treatment was outside the clinic or out of office hours.
domain: Claim.ItemComponent
range: CodeableConcept
title: Service/Product billing modifiers

Account.type
type: ObjectProperty
comment: Categorizes the account for reporting and searching purposes.
domain: Account
range: CodeableConcept
sub property of: class
title: E.g. patient, expense, depreciation

Provenance.occurredDateTime
type: ObjectProperty
domain: Provenance
range: dateTime
sub property of: Provenance.occurred

Composition.section.section.title
type: ObjectProperty
comment: The label for this particular section. This will be part of the rendered content for the document, and is often used to build a table of contents.
domain: Composition.SectionComponentSection
range: string
title: Label for section (e.g. for ToC)

ResearchStudy.reasonStopped
type: ObjectProperty
comment: A description and/or code explaining the premature termination of the study.
domain: ResearchStudy
range: CodeableConcept
sub property of: why
title: accrual-goal-met | closed-due-to-toxicity | closed-due-to-lack-of-study-progress | temporarily-closed-per-study-design

NutritionOrder.supplement.instruction
type: ObjectProperty
comment: Free text or additional instructions or information pertaining to the oral supplement.
domain: NutritionOrderSupplementComponent
range: string
title: Instructions or additional information about the oral supplement

SupplyDelivery.supplier
type: ObjectProperty
comment: The individual responsible for dispensing the medication, supplier or device.
domain: SupplyDelivery
range: Reference
title: Dispenser

MedicinalProductAuthorization.procedure.identifier
type: ObjectProperty
comment: Identifier for this procedure.
domain: MedicinalProductAuthorizationProcedureComponent
range: Identifier
title: Identifier for this procedure

Appointment.participant
type: ObjectProperty
comment: List of participants involved in the appointment.
domain: Appointment
range: AppointmentParticipantComponent
title: Participants involved in appointment

TriggerDefinition.timingDate
type: ObjectProperty
domain: TriggerDefinition
range: date
sub property of: TriggerDefinition.timing

Provenance.agent.onBehalfOf
type: ObjectProperty
comment: The individual, device, or organization for whom the change was made.
domain: ProvenanceAgentComponent
range: Reference
title: Who the agent is representing

ImplementationGuide.definition.page.page
type: ObjectProperty
comment: Nested Pages/Sections under this page.
domain: ImplementationGuideDefinitionComponent.ImplementationGuideDefinitionPageComponent
range: ImplementationGuideDefinitionComponent.ImplementationGuideDefinitionPageComponentPage
title: Nested Pages / Sections

Observation.effectiveDateTime
type: ObjectProperty
domain: Observation
range: dateTime
sub property of: Observation.effective

Communication.instantiatesUri
type: ObjectProperty
comment: The URL pointing to an externally maintained protocol, guideline, orderset or other definition that is adhered to in whole or in part by this Communication.
domain: Communication
range: uri
title: Instantiates external protocol or definition

ValueSet.date
type: ObjectProperty
comment: The date (and optionally time) when the value set was published. The date must change when the business version changes and it must change if the status code changes. In addition, it should change when the substantive content of the value set changes. (e.g. the 'content logical definition').
domain: ValueSet
range: dateTime
sub property of: when.recorded
title: Date last changed

MedicationKnowledge.regulatory.substitution
type: ObjectProperty
comment: Specifies if changes are allowed when dispensing a medication from a regulatory perspective.
domain: MedicationKnowledgeRegulatoryComponent
range: MedicationKnowledgeRegulatoryComponent.MedicationKnowledgeRegulatorySubstitutionComponent
title: Specifies if changes are allowed when dispensing a medication from a regulatory perspective

Contract.term.group.offer.answer.valueBoolean
type: ObjectProperty
domain: Contract.TermComponentTerm.ContractOfferComponent.AnswerComponent
range: boolean
sub property of: Contract.term.group.offer.answer.value

Attachment.contentType
type: ObjectProperty
comment: Identifies the type of the data in the attachment and allows a method to be chosen to interpret or render the data. Includes mime type parameters such as charset where appropriate.
domain: Attachment
range: code
title: Mime type of the content, with charset etc.

DeviceRequest.subject
type: ObjectProperty
comment: The patient who will use the device.
domain: DeviceRequest
range: Reference
sub property of: who.focus
title: Focus of request

DeviceRequest.instantiatesCanonical
type: ObjectProperty
comment: The URL pointing to a FHIR-defined protocol, guideline, orderset or other definition that is adhered to in whole or in part by this DeviceRequest.
domain: DeviceRequest
range: canonical
title: Instantiates FHIR protocol or definition

Contract.term.group.action.occurrenceDateTime
type: ObjectProperty
domain: Contract.TermComponentTerm.ActionComponent
range: dateTime
sub property of: Contract.term.group.action.occurrence

ResearchStudy.primaryPurposeType
type: ObjectProperty
comment: The type of study based upon the intent of the study's activities. A classification of the intent of the study.
domain: ResearchStudy
range: CodeableConcept
title: treatment | prevention | diagnostic | supportive-care | screening | health-services-research | basic-science | device-feasibility

MedicationKnowledgeMonographComponent
type: Class
comment: Associated documentation about the medication.
subclass of: BackboneElement
subclass of: Restriction
  all values from: Reference
  max cardinality: 1
  on property: MedicationKnowledge.monograph.source
subclass of: Restriction
  all values from: CodeableConcept
  max cardinality: 1
  on property: MedicationKnowledge.monograph.type

DeviceRequest.instantiatesUri
type: ObjectProperty
comment: The URL pointing to an externally maintained protocol, guideline, orderset or other definition that is adhered to in whole or in part by this DeviceRequest.
domain: DeviceRequest
range: uri
title: Instantiates external protocol or definition

DetectedIssue
type: Class
comment: Indicates an actual or potential clinical issue with or between one or more active or proposed clinical actions for a patient; e.g. Drug-drug interaction, Ineffective treatment frequency, Procedure-condition conflict, etc.
subclass of: clinical.general
subclass of: DomainResource
subclass of: Restriction
  all values from: string
  max cardinality: 1
  on property: DetectedIssue.detail
subclass of: Restriction
  all values from: dateTime
  max cardinality: 1
  on property: DetectedIssue.date
subclass of: Restriction
  all values from: Identifier
  on property: DetectedIssue.identifier
subclass of: Restriction
  all values from: CodeableConcept
  max cardinality: 1
  on property: DetectedIssue.category
subclass of: Restriction
  all values from: uri
  max cardinality: 1
  on property: DetectedIssue.reference
subclass of: Restriction
  all values from: Reference
  max cardinality: 1
  on property: DetectedIssue.patient
subclass of: Restriction
  all values from: Reference
  on property: DetectedIssue.implicated
subclass of: Restriction
  all values from: DetectedIssueMitigationComponent
  on property: DetectedIssue.mitigation
subclass of: Restriction
  cardinality: 1
  on property: DetectedIssue.status
  some values from: code
subclass of: Restriction
  all values from: Reference
  max cardinality: 1
  on property: DetectedIssue.author
subclass of: Restriction
  all values from: code
  max cardinality: 1
  on property: DetectedIssue.severity

ChargeItemDefinition.replaces
type: ObjectProperty
comment: As new versions of a protocol or guideline are defined, allows identification of what versions are replaced by a new instance.
domain: ChargeItemDefinition
range: canonical
title: Completed or terminated request(s) whose function is taken by this new request

Claim.information.sequence
type: ObjectProperty
comment: Sequence of the information element which serves to provide a link.
domain: Claim.SpecialConditionComponent
range: positiveInt
title: Information instance identifier

QuestionnaireItemComponentItem.QuestionnaireItemInitialComponent
type: Class
comment: One or more values that should be pre-populated in the answer when initially rendering the questionnaire for user input.
subclass of: BackboneElement
subclass of:
  union of: Restriction
    cardinality: 1
    on property: Questionnaire.item.item.initial.valueBoolean
    some values from: boolean
  union of: Restriction
    cardinality: 1
    on property: Questionnaire.item.item.initial.valueDecimal
    some values from: decimal
  union of: Restriction
    cardinality: 1
    on property: Questionnaire.item.item.initial.valueInteger
    some values from: integer
  union of: Restriction
    cardinality: 1
    on property: Questionnaire.item.item.initial.valueDate
    some values from: date
  union of: Restriction
    cardinality: 1
    on property: Questionnaire.item.item.initial.valueDateTime
    some values from: dateTime
  union of: Restriction
    cardinality: 1
    on property: Questionnaire.item.item.initial.valueTime
    some values from: time
  union of: Restriction
    cardinality: 1
    on property: Questionnaire.item.item.initial.valueString
    some values from: string
  union of: Restriction
    cardinality: 1
    on property: Questionnaire.item.item.initial.valueUri
    some values from: uri
  union of: Restriction
    cardinality: 1
    on property: Questionnaire.item.item.initial.valueAttachment
    some values from: Attachment
  union of: Restriction
    cardinality: 1
    on property: Questionnaire.item.item.initial.valueCoding
    some values from: Coding
  union of: Restriction
    cardinality: 1
    on property: Questionnaire.item.item.initial.valueQuantity
    some values from: Quantity
  union of: Restriction
    cardinality: 1
    on property: Questionnaire.item.item.initial.valueReference
    some values from: Reference

MedicinalProductIngredient.substance.strength.presentationLowLimit
type: ObjectProperty
comment: A lower limit for the quantity of substance in the unit of presentation. For use when there is a range of strengths, this is the lower limit, with the presentation attribute becoming the upper limit.
domain: MedicinalProductIngredientSubstanceComponentStrength
range: Ratio
title: A lower limit for the quantity of substance in the unit of presentation. For use when there is a range of strengths, this is the lower limit, with the presentation attribute becoming the upper limit

CoverageEligibilityRequest.facility
type: ObjectProperty
comment: Facility where the services were provided.
domain: CoverageEligibilityRequest
range: Reference
sub property of: where
title: Servicing Facility

ChargeItemDefinition.approvalDate
type: ObjectProperty
comment: The date on which the resource content was approved by the publisher. Approval happens once when the content is officially approved for usage.
domain: ChargeItemDefinition
range: date
title: When the charge item definition was approved by publisher

SearchParameter.code
type: ObjectProperty
comment: The code used in the URL or the parameter name in a parameters resource for this search parameter.
domain: SearchParameter
range: code
title: Code used in URL

TestScript.origin.index
type: ObjectProperty
comment: Abstract name given to an origin server in this test script. The name is provided as a number starting at 1.
domain: TestScriptOriginComponent
range: integer
title: The index of the abstract origin server starting at 1

ElementDefinition.constraint.severity
type: ObjectProperty
comment: Identifies the impact constraint violation has on the conformance of the instance.
domain: ElementDefinitionConstraintComponent
range: code
title: error | warning

Library.description
type: ObjectProperty
comment: A free text natural language description of the library from a consumer's perspective.
domain: Library
range: markdown
title: Natural language description of the library

NutritionOrder.oralDiet.texture.modifier
type: ObjectProperty
comment: Any texture modifications (for solid foods) that should be made, e.g. easy to chew, chopped, ground, and pureed.
domain: NutritionOrderOralDietComponent.NutritionOrderOralDietTextureComponent
range: CodeableConcept
title: Code to indicate how to alter the texture of the foods, e.g. pureed

VerificationResult.lastPerformed
type: ObjectProperty
comment: The date/time validation was last completed (incl. failed validations).
domain: VerificationResult
range: dateTime
title: The date/time validation was last completed (incl. failed validations)

Consent.provision.purpose
type: ObjectProperty
comment: The context of the activities a user is taking - why the user is accessing the data - that are controlled by this rule.
domain: Consent.provisionComponent
range: Coding
title: Context of activities covered by this rule

PlanDefinition.goal.addresses
type: ObjectProperty
comment: Identifies problems, conditions, issues, or concerns the goal is intended to address.
domain: PlanDefinitionGoalComponent
range: CodeableConcept
title: What does the goal address

FamilyMemberHistory.condition
type: ObjectProperty
comment: The significant Conditions (or condition) that the family member had. This is a repeating section to allow a system to represent more than one condition per resource, though there is nothing stopping multiple resources - one per condition.
domain: FamilyMemberHistory
range: FamilyMemberHistoryConditionComponent
title: Condition that the related person had

SpecimenDefinitionSpecimenToLabComponent
type: Class
comment: Specimen conditioned in a container as expected by the testing laboratory.
subclass of: BackboneElement
subclass of: Restriction
  all values from: SimpleQuantity
  max cardinality: 1
  on property: SpecimenDefinition.specimenToLab.containerCapacity
subclass of: Restriction
  cardinality: 1
  on property: SpecimenDefinition.specimenToLab.preference
  some values from: code
subclass of: Restriction
  all values from: SimpleQuantity
  max cardinality: 1
  on property: SpecimenDefinition.specimenToLab.containerMinimumVolume
subclass of: Restriction
  all values from: CodeableConcept
  on property: SpecimenDefinition.specimenToLab.rejectionCriterion
subclass of: Restriction
  all values from: string
  max cardinality: 1
  on property: SpecimenDefinition.specimenToLab.containerDescription
subclass of: Restriction
  all values from: CodeableConcept
  max cardinality: 1
  on property: SpecimenDefinition.specimenToLab.type
subclass of: Restriction
  all values from: CodeableConcept
  max cardinality: 1
  on property: SpecimenDefinition.specimenToLab.containerCap
subclass of: Restriction
  all values from: CodeableConcept
  max cardinality: 1
  on property: SpecimenDefinition.specimenToLab.containerType
subclass of: Restriction
  all values from: Duration
  max cardinality: 1
  on property: SpecimenDefinition.specimenToLab.retentionTime
subclass of: Restriction
  cardinality: 1
  on property: SpecimenDefinition.specimenToLab.isDerived
  some values from: boolean
subclass of: Restriction
  all values from: string
  max cardinality: 1
  on property: SpecimenDefinition.specimenToLab.containerPreparation
subclass of: Restriction
  all values from: string
  max cardinality: 1
  on property: SpecimenDefinition.specimenToLab.requirement
subclass of: Restriction
  all values from: SpecimenDefinitionSpecimenToLabComponent.SpecimenDefinitionSpecimenToLabContainerAdditiveComponent
  on property: SpecimenDefinition.specimenToLab.containerAdditive
subclass of: Restriction
  all values from: SpecimenDefinitionSpecimenToLabComponent.SpecimenDefinitionSpecimenToLabHandlingComponent
  on property: SpecimenDefinition.specimenToLab.handling
subclass of: Restriction
  all values from: CodeableConcept
  max cardinality: 1
  on property: SpecimenDefinition.specimenToLab.containerMaterial

TestScript.metadata.link.url
type: ObjectProperty
comment: URL to a particular requirement or feature within the FHIR specification.
domain: TestScriptMetadataComponent.TestScriptMetadataLinkComponent
range: uri
title: URL to the specification

QuestionnaireItemComponentItem
type: Class
comment: Text, questions and other groups to be nested beneath a question or group.
subclass of: BackboneElement
subclass of: Restriction
  all values from: QuestionnaireItemComponentItem.QuestionnaireItemInitialComponent
  on property: Questionnaire.item.item.initial
subclass of: Restriction
  all values from: boolean
  max cardinality: 1
  on property: Questionnaire.item.item.repeats
subclass of: Restriction
  all values from: canonical
  max cardinality: 1
  on property: Questionnaire.item.item.answerValueSet
subclass of: Restriction
  all values from: string
  max cardinality: 1
  on property: Questionnaire.item.item.prefix
subclass of: Restriction
  cardinality: 1
  on property: Questionnaire.item.item.linkId
  some values from: string
subclass of: Restriction
  all values from: boolean
  max cardinality: 1
  on property: Questionnaire.item.item.readOnly
subclass of: Restriction
  all values from: QuestionnaireItemComponentItem.QuestionnaireItemAnswerOptionComponent
  on property: Questionnaire.item.item.answerOption
subclass of: Restriction
  all values from: code
  max cardinality: 1
  on property: Questionnaire.item.item.enableBehavior
subclass of: Restriction
  all values from: uri
  max cardinality: 1
  on property: Questionnaire.item.item.definition
subclass of: Restriction
  all values from: QuestionnaireItemComponentItemItem
  on property: Questionnaire.item.item.item
subclass of: Restriction
  all values from: string
  max cardinality: 1
  on property: Questionnaire.item.item.text
subclass of: Restriction
  all values from: integer
  max cardinality: 1
  on property: Questionnaire.item.item.maxLength
subclass of: Restriction
  cardinality: 1
  on property: Questionnaire.item.item.type
  some values from: code
subclass of: Restriction
  all values from: Coding
  on property: Questionnaire.item.item.code
subclass of: Restriction
  all values from: boolean
  max cardinality: 1
  on property: Questionnaire.item.item.required
subclass of: Restriction
  all values from: QuestionnaireItemComponentItem.QuestionnaireItemEnableWhenComponent
  on property: Questionnaire.item.item.enableWhen
title: Nested questionnaire items

ServiceRequest.occurrence
type: ObjectProperty

ExampleScenario.process.step.alternative.option.step.process.step.process
type: ObjectProperty
comment: Nested process.
domain: ExampleScenarioProcessComponent.ExampleScenarioProcessStepComponent.ExampleScenarioProcessStepAlternativeComponent.ExampleScenarioProcessStepAlternativeOptionComponentStepProcess.ExampleScenarioProcessStepComponent
range: ExampleScenarioProcessComponent.ExampleScenarioProcessStepComponent.ExampleScenarioProcessStepAlternativeComponent.ExampleScenarioProcessStepAlternativeOptionComponentStepProcess.ExampleScenarioProcessStepComponentProcess
title: Nested process

UsageContext.valueCodeableConcept
type: ObjectProperty
domain: UsageContext
range: CodeableConcept
sub property of: UsageContext.value

PlanDefinitionActionComponent.PlanDefinitionActionParticipantComponent
type: Class
comment: Indicates who should participate in performing the action described.
subclass of: BackboneElement
subclass of: Restriction
  all values from: CodeableConcept
  max cardinality: 1
  on property: PlanDefinition.action.participant.role
subclass of: Restriction
  cardinality: 1
  on property: PlanDefinition.action.participant.type
  some values from: code

PatientLinkComponent
type: Class
comment: Link to another patient resource that concerns the same actual patient.
subclass of: BackboneElement
subclass of: Restriction
  cardinality: 1
  on property: Patient.link.type
  some values from: code
subclass of: Restriction
  cardinality: 1
  on property: Patient.link.other
  some values from: Reference

MessageDefinition.useContext
type: ObjectProperty
comment: The content was developed with a focus and intent of supporting the contexts that are listed. These terms may be used to assist with indexing and searching for appropriate message definition instances.
domain: MessageDefinition
range: UsageContext
title: The context that the content is intended to support

ExplanationOfBenefit.addItem.detail.subDetail.factor
type: ObjectProperty
comment: A real number that represents a multiplier used in determining the overall value of services delivered and/or goods received. The concept of a Factor allows for a discount or surcharge multiplier to be applied to a monetary amount.
domain: ExplanationOfBenefit.AddedItemComponent.AddedItemDetailComponent.AddedItemDetailSubDetailComponent
range: decimal
title: Price scaling factor

ConceptMap.group.unmapped.code
type: ObjectProperty
comment: The fixed code to use when the mode = 'fixed' - all unmapped codes are mapped to a single fixed code.
domain: ConceptMapGroupComponent.ConceptMapGroupUnmappedComponent
range: code
title: Fixed code when mode = fixed

Coverage.network
type: ObjectProperty
comment: The insurer-specific identifier for the insurer-defined network of providers to which the beneficiary may seek treatment which will be covered at the 'in-network' rate, otherwise 'out of network' terms and conditions apply.
domain: Coverage
range: string
title: Insurer network

Composition.section.section.text
type: ObjectProperty
comment: A human-readable narrative that contains the attested content of the section, used to represent the content of the resource to a human. The narrative need not encode all the structured data, but is required to contain sufficient detail to make it "clinically safe" for a human to just read the narrative.
domain: Composition.SectionComponentSection
range: Narrative
title: Text summary of the section, for human interpretation

TestReport.setup.action.assert.detail
type: ObjectProperty
comment: A link to further details on the result.
domain: TestReportSetupComponent.SetupActionComponent.SetupActionAssertComponent
range: string
title: A link to further details on the result

PaymentReconciliation.processNote.type
type: ObjectProperty
comment: The note purpose: Print/Display.
domain: PaymentReconciliation.NotesComponent
range: code
title: display | print | printoper

ProcedureFocalDeviceComponent
type: Class
comment: A device that is implanted, removed or otherwise manipulated (calibration, battery replacement, fitting a prosthesis, attaching a wound-vac, etc.) as a focal portion of the Procedure.
subclass of: BackboneElement
subclass of: Restriction
  cardinality: 1
  on property: Procedure.focalDevice.manipulated
  some values from: Reference
subclass of: Restriction
  all values from: CodeableConcept
  max cardinality: 1
  on property: Procedure.focalDevice.action

CarePlan.activity
type: ObjectProperty
comment: Identifies a planned action to occur as part of the plan. For example, a medication to be used, lab tests to perform, self-monitoring, education, etc.
domain: CarePlan
range: CarePlanActivityComponent
title: Action to occur as part of plan

TerminologyCapabilities.codeSearch
type: ObjectProperty
comment: The degree to which the server supports the code search parameter on ValueSet, if it is supported.
domain: TerminologyCapabilities
range: code
title: explicit | all

CapabilityStatementSoftwareComponent
type: Class
comment: Software that is covered by this capability statement. It is used when the capability statement describes the capabilities of a particular software version, independent of an installation.
subclass of: BackboneElement
subclass of: Restriction
  all values from: dateTime
  max cardinality: 1
  on property: CapabilityStatement.software.releaseDate
subclass of: Restriction
  all values from: string
  max cardinality: 1
  on property: CapabilityStatement.software.version
subclass of: Restriction
  cardinality: 1
  on property: CapabilityStatement.software.name
  some values from: string

Sequence.structureVariant.precision
type: ObjectProperty
comment: Identify the exact boundaries of variant sequences. Each type of structure variant requires the DNA duplex to be broken and rejoined, and this creates a new sequence of bases at the rejoined sites, known as breakpoints or boundaries.
domain: SequenceStructureVariantComponent
range: string
title: Precision of boundaries

ImmunizationRecommendation.recommendation.seriesDoses
type: ObjectProperty

Contract.term.group.action.reasonLinkId
type: ObjectProperty
comment: Id [identifier??] of the clause or question text related to the reason type or reference of this action in the referenced form or QuestionnaireResponse.
domain: Contract.TermComponentTerm.ActionComponent
range: string
title: Pointer to specific item

PlanDefinition.action.action.timingDuration
type: ObjectProperty
domain: PlanDefinitionActionComponentAction
range: Duration
sub property of: PlanDefinition.action.action.timing

SubstanceReferenceInformation.target.amount
type: ObjectProperty

ExplanationOfBenefit.item.detail.modifier
type: ObjectProperty
comment: Item typification or modifiers codes, e.g. for Oral whether the treatment is cosmetic or associated with TMJ, or for medical whether the treatment was outside the clinic or out of office hours.
domain: ExplanationOfBenefit.ItemComponent.DetailComponent
range: CodeableConcept
title: Service/Product billing modifiers

Questionnaire.item.item.readOnly
type: ObjectProperty
comment: An indication, when true, that the value cannot be changed by a human respondent to the Questionnaire.
domain: QuestionnaireItemComponentItem
range: boolean
title: Don't allow human editing

SpecimenDefinition.specimenToLab.containerAdditive.additiveCodeableConcept
type: ObjectProperty
domain: SpecimenDefinitionSpecimenToLabComponent.SpecimenDefinitionSpecimenToLabContainerAdditiveComponent
range: CodeableConcept
sub property of: SpecimenDefinition.specimenToLab.containerAdditive.additive

ExampleScenario.process.step.alternative.option.step.operation.number
type: ObjectProperty
comment: The sequential number of the interaction, e.g. 1.2.5.
domain: ExampleScenarioProcessComponent.ExampleScenarioProcessStepComponent.ExampleScenarioProcessStepAlternativeComponent.ExampleScenarioProcessStepAlternativeOptionComponentStep.ExampleScenarioProcessStepOperationComponent
range: string
title: The sequential number of the interaction

ExplanationOfBenefit.diagnosis.type
type: ObjectProperty
comment: The type of the Diagnosis, for example: admitting, primary, secondary, discharge.
domain: ExplanationOfBenefit.DiagnosisComponent
range: CodeableConcept
title: Timing or nature of the diagnosis

Sequence.type
type: ObjectProperty
comment: Amino Acid Sequence/ DNA Sequence / RNA Sequence.
domain: Sequence
range: code
title: aa | dna | rna

PlanDefinition.subjectReference
type: ObjectProperty
domain: PlanDefinition
range: Reference
sub property of: PlanDefinition.subject

VisionPrescription.encounter
type: ObjectProperty
comment: A link to a resource that identifies the particular occurrence of contact between patient and health care provider.
domain: VisionPrescription
range: Reference
sub property of: context
title: Created during encounter / admission / stay

SearchParameter.status
type: ObjectProperty
comment: The status of this search parameter. Enables tracking the life-cycle of the content.
domain: SearchParameter
range: code
sub property of: status
title: draft | active | retired | unknown

MedicationDispense.status
type: ObjectProperty
comment: A code specifying the state of the set of dispense events.
domain: MedicationDispense
range: code
sub property of: status
title: preparation | in-progress | cancelled | on-hold | completed | entered-in-error | stopped | unknown

ClaimResponse.subType
type: ObjectProperty
comment: A finer grained suite of claim subtype codes which may convey Inpatient vs Outpatient and/or a specialty service. In the US the CMS Bill Type.
domain: ClaimResponse
range: CodeableConcept
sub property of: class
title: Finer grained claim type information

AllergyIntolerance.clinicalStatus
type: ObjectProperty
comment: The clinical status of the allergy or intolerance.
domain: AllergyIntolerance
range: code
sub property of: status
title: active | inactive | resolved

ExampleScenario.process.step.operation.type
type: ObjectProperty
comment: The type of operation - CRUD.
domain: ExampleScenarioProcessComponent.ExampleScenarioProcessStepComponent.ExampleScenarioProcessStepOperationComponent
range: string
title: The type of operation - CRUD

MedicinalProductClinicals.contraindication.comorbidity
type: ObjectProperty
comment: A comorbidity (concurrent condition) or coinfection.
domain: MedicinalProductClinicalsContraindicationComponent
range: CodeableConcept
title: A comorbidity (concurrent condition) or coinfection

MedicationAdministration.context
type: ObjectProperty
comment: The visit, admission, or other contact between patient and health care provider during which the medication administration was performed.
domain: MedicationAdministration
range: Reference
sub property of: context
title: Encounter or Episode of Care administered as part of

TestScript.setup.action.operation.url
type: ObjectProperty
comment: Complete request URL.
domain: TestScriptSetupComponent.SetupActionComponent.SetupActionOperationComponent
range: string
title: Request URL

PlanDefinition.action.precheckBehavior
type: ObjectProperty
comment: Defines whether the action should usually be preselected.
domain: PlanDefinitionActionComponent
range: code
title: yes | no

Encounter.participant
type: ObjectProperty
comment: The list of people responsible for providing the service.
domain: Encounter
range: EncounterParticipantComponent
title: List of participants involved in the encounter

MedicinalProductContraindicationPopulationComponent
type: Class
comment: The population group to which this applies.
subclass of: BackboneElement
subclass of: Restriction
  all values from: CodeableConcept
  max cardinality: 1
  on property: MedicinalProductContraindication.population.physiologicalCondition
subclass of: Restriction
  all values from: CodeableConcept
  max cardinality: 1
  on property: MedicinalProductContraindication.population.race
subclass of: Restriction
  all values from: CodeableConcept
  max cardinality: 1
  on property: MedicinalProductContraindication.population.gender
subclass of:
  union of: Restriction
    all values from: Range
    max cardinality: 1
    on property: MedicinalProductContraindication.population.ageRange
  union of: Restriction
    all values from: CodeableConcept
    max cardinality: 1
    on property: MedicinalProductContraindication.population.ageCodeableConcept

Contract.term.asset.valuedItem.points
type: ObjectProperty
comment: An amount that expresses the weighting (based on difficulty, cost and/or resource intensiveness) associated with the Contract Valued Item delivered. The concept of Points allows for assignment of point values for a Contract Valued Item, such that a monetary amount can be assigned to each point.
domain: Contract.TermComponent.ContractAssetComponent.ValuedItemComponent
range: decimal
sub property of: what
title: Contract Valued Item Difficulty Scaling Factor

CarePlan.activity.detail.product
type: ObjectProperty

NamingSystemUniqueIdComponent
type: Class
comment: Indicates how the system may be identified when referenced in electronic exchange.
subclass of: BackboneElement
subclass of: Restriction
  all values from: Period
  max cardinality: 1
  on property: NamingSystem.uniqueId.period
subclass of: Restriction
  all values from: string
  max cardinality: 1
  on property: NamingSystem.uniqueId.comment
subclass of: Restriction
  all values from: boolean
  max cardinality: 1
  on property: NamingSystem.uniqueId.preferred
subclass of: Restriction
  cardinality: 1
  on property: NamingSystem.uniqueId.value
  some values from: string
subclass of: Restriction
  cardinality: 1
  on property: NamingSystem.uniqueId.type
  some values from: code

Count
type: Class
comment: A measured amount (or an amount that can potentially be measured). Note that measured amounts include amounts that are not precisely quantified, including amounts involving arbitrary units and floating currencies.
subclass of: Quantity
title: A measured or measurable amount

ObservationDefinitionQualifiedIntervalComponent
type: Class
comment: Reference range for ordinal and continuous observations.
subclass of: BackboneElement
subclass of: Restriction
  all values from: Range
  max cardinality: 1
  on property: ObservationDefinition.qualifiedInterval.age
subclass of: Restriction
  all values from: string
  max cardinality: 1
  on property: ObservationDefinition.qualifiedInterval.condition
subclass of: Restriction
  all values from: Range
  max cardinality: 1
  on property: ObservationDefinition.qualifiedInterval.range
subclass of: Restriction
  all values from: CodeableConcept
  max cardinality: 1
  on property: ObservationDefinition.qualifiedInterval.category
subclass of: Restriction
  all values from: CodeableConcept
  on property: ObservationDefinition.qualifiedInterval.appliesTo
subclass of: Restriction
  all values from: Range
  max cardinality: 1
  on property: ObservationDefinition.qualifiedInterval.gestationalAge
subclass of: Restriction
  all values from: CodeableConcept
  max cardinality: 1
  on property: ObservationDefinition.qualifiedInterval.type

ValueSet.compose.exclude.filter
type: ObjectProperty
comment: Select concepts by specify a matching criteria based on the properties (including relationships) defined by the system. If multiple filters are specified, they SHALL all be true.
domain: ValueSetComposeComponentInclude
range: ValueSetComposeComponentInclude.ConceptSetFilterComponent
title: Select codes/concepts by their properties (including relationships)

CoverageEligibilityRequest.item.unitPrice
type: ObjectProperty
comment: The fee for an additional service or product or charge.
domain: CoverageEligibilityRequest.DetailsComponent
range: Money
title: Fee, charge or cost per point

ExampleScenario.process.step.alternative.option.pause
type: ObjectProperty
comment: If there is a pause in the flow.
domain: ExampleScenarioProcessComponent.ExampleScenarioProcessStepComponent.ExampleScenarioProcessStepAlternativeComponent.ExampleScenarioProcessStepAlternativeOptionComponent
range: boolean
title: If there is a pause in the flow

MedicationKnowledge.ingredient.item
type: ObjectProperty

CodeableConcept.coding
type: ObjectProperty
comment: A reference to a code defined by a terminology system.
domain: CodeableConcept
range: Coding
title: Code defined by a terminology system

RequestGroup.action.timingAge
type: ObjectProperty
domain: RequestGroupActionComponent
range: Age
sub property of: RequestGroup.action.timing

Encounter.appointment
type: ObjectProperty
comment: The appointment that scheduled this encounter.
domain: Encounter
range: Reference
title: The appointment that scheduled this encounter

MessageHeader.responsible
type: ObjectProperty
comment: The person or organization that accepts overall responsibility for the contents of the message. The implication is that the message event happened under the policies of the responsible party.
domain: MessageHeader
range: Reference
sub property of: who.witness
title: Final responsibility for event

Meta.source
type: ObjectProperty
comment: A uri that identifies the source system of the resource. This provides a minimal amount of [Provenance] information that can be used to track or differentiate the source of information in the resource. The source may identify another FHIR server, document, message, database, etc.
domain: Meta
range: uri
title: Identifies where the resource comes from

MedicinalProductManufactured.unitOfPresentation
type: ObjectProperty
comment: The “real world” units in which the quantity of the manufactured item is described.
domain: MedicinalProductManufactured
range: CodeableConcept
title: The “real world” units in which the quantity of the manufactured item is described

BiologicallyDerivedProduct.collection.collector
type: ObjectProperty
comment: HealthCare Professional performing collection.
domain: BiologicallyDerivedProductCollectionComponent
range: Reference
title: HealthCare Professional performing collection

TestScript.setup.action.operation.type
type: ObjectProperty
comment: Server interaction or operation type.
domain: TestScriptSetupComponent.SetupActionComponent.SetupActionOperationComponent
range: Coding
title: The operation code type that will be executed

ClaimResponse
type: Class
comment: This resource provides the adjudication details from the processing of a Claim resource.
subclass of: financial.billing
subclass of: DomainResource
subclass of: Restriction
  all values from: ClaimResponse.ErrorComponent
  on property: ClaimResponse.error
subclass of: Restriction
  all values from: ClaimResponse.TotalComponent
  on property: ClaimResponse.total
subclass of: Restriction
  all values from: CodeableConcept
  max cardinality: 1
  on property: ClaimResponse.subType
subclass of: Restriction
  all values from: dateTime
  max cardinality: 1
  on property: ClaimResponse.created
subclass of: Restriction
  all values from: Reference
  max cardinality: 1
  on property: ClaimResponse.request
subclass of: Restriction
  all values from: CodeableConcept
  max cardinality: 1
  on property: ClaimResponse.form
subclass of: Restriction
  all values from: code
  max cardinality: 1
  on property: ClaimResponse.status
subclass of: Restriction
  all values from: ClaimResponse.AddedItemComponent
  on property: ClaimResponse.addItem
subclass of: Restriction
  all values from: Coding
  max cardinality: 1
  on property: ClaimResponse.reserved
subclass of: Restriction
  all values from: CodeableConcept
  max cardinality: 1
  on property: ClaimResponse.payeeType
subclass of: Restriction
  all values from: string
  max cardinality: 1
  on property: ClaimResponse.disposition
subclass of: Restriction
  all values from: CodeableConcept
  max cardinality: 1
  on property: ClaimResponse.type
subclass of: Restriction
  all values from: Reference
  max cardinality: 1
  on property: ClaimResponse.patient
subclass of: Restriction
  all values from: Reference
  max cardinality: 1
  on property: ClaimResponse.requestProvider
subclass of: Restriction
  all values from: Reference
  on property: ClaimResponse.communicationRequest
subclass of: Restriction
  all values from: ClaimResponse.InsuranceComponent
  on property: ClaimResponse.insurance
subclass of: Restriction
  all values from: ClaimResponse.ItemComponent
  on property: ClaimResponse.item
subclass of: Restriction
  all values from: Identifier
  on property: ClaimResponse.identifier
subclass of: Restriction
  all values from: ClaimResponse.PaymentComponent
  max cardinality: 1
  on property: ClaimResponse.payment
subclass of: Restriction
  all values from: string
  max cardinality: 1
  on property: ClaimResponse.preAuthRef
subclass of: Restriction
  all values from: code
  max cardinality: 1
  on property: ClaimResponse.use
subclass of: Restriction
  all values from: Reference
  max cardinality: 1
  on property: ClaimResponse.insurer
subclass of: Restriction
  all values from: code
  max cardinality: 1
  on property: ClaimResponse.outcome
subclass of: Restriction
  all values from: ClaimResponse.NoteComponent
  on property: ClaimResponse.processNote

ValueSet.expansion.contains.contains.designation.language
type: ObjectProperty
comment: The language this designation is defined for.
domain: ValueSetExpansionComponent.ValueSetExpansionContainsComponentContainsDesignation
range: code
title: Human language of the designation

RiskAssessment.prediction.probabilityDecimal
type: ObjectProperty
domain: RiskAssessmentPredictionComponent
range: decimal
sub property of: RiskAssessment.prediction.probability

Provenance.target
type: ObjectProperty
comment: The Reference(s) that were generated or updated by the activity described in this resource. A provenance can point to more than one target if multiple resources were created/updated by the same activity.
domain: Provenance
range: Reference
sub property of: what
title: Target Reference(s) (usually version specific)

ExplanationOfBenefit.addItem.detail.subDetail.adjudication.category
type: ObjectProperty
comment: Code indicating: Co-Pay, deductable, elegible, benefit, tax, etc.
domain: ExplanationOfBenefit.AddedItemComponent.AddedItemDetailComponent.AddedItemDetailSubDetailComponentAdjudication
range: CodeableConcept
title: Adjudication category such as co-pay, eligible, benefit, etc.

SearchParameter.publisher
type: ObjectProperty
comment: The name of the organization or individual that published the search parameter.
domain: SearchParameter
range: string
sub property of: who.witness
title: Name of the publisher (organization or individual)

Bundle
type: Class
comment: A container for a collection of resources.
subclass of: infrastructure.structure
subclass of: Resource
subclass of: Restriction
  cardinality: 1
  on property: Bundle.type
  some values from: code
subclass of: Restriction
  all values from: instant
  max cardinality: 1
  on property: Bundle.timestamp
subclass of: Restriction
  all values from: unsignedInt
  max cardinality: 1
  on property: Bundle.total
subclass of: Restriction
  all values from: BundleEntryComponent
  on property: Bundle.entry
subclass of: Restriction
  all values from: Identifier
  max cardinality: 1
  on property: Bundle.identifier
subclass of: Restriction
  all values from: Signature
  max cardinality: 1
  on property: Bundle.signature
subclass of: Restriction
  all values from: BundleLinkComponent
  on property: Bundle.link

ExampleScenario.process.step.process.step.alternative.option.step.operation.response
type: ObjectProperty
comment: Each resource instance used by the responder.
domain: ExampleScenarioProcessComponent.ExampleScenarioProcessStepComponentProcess.ExampleScenarioProcessStepComponent.ExampleScenarioProcessStepAlternativeComponent.ExampleScenarioProcessStepAlternativeOptionComponentStep.ExampleScenarioProcessStepOperationComponent
range: ExampleScenarioProcessComponent.ExampleScenarioProcessStepComponentProcess.ExampleScenarioProcessStepComponent.ExampleScenarioProcessStepAlternativeComponent.ExampleScenarioProcessStepAlternativeOptionComponentStep.ExampleScenarioProcessStepOperationComponentContainedInstance
title: Each resource instance used by the responder

VerificationResult.primarySource.validationStatus
type: ObjectProperty
comment: Status of the validation of the target against the primary source (successful; failed; unknown).
domain: VerificationResultPrimarySourceComponent
range: CodeableConcept
title: successful | failed | unknown

CodeSystem.concept.property
type: ObjectProperty
comment: A property value for this concept.
domain: CodeSystem.ConceptDefinitionComponent
range: CodeSystem.ConceptDefinitionComponent.ConceptPropertyComponent
title: Property value for the concept

Questionnaire.item.item.initial.valueInteger
type: ObjectProperty
domain: QuestionnaireItemComponentItem.QuestionnaireItemInitialComponent
range: integer
sub property of: Questionnaire.item.item.initial.value

Questionnaire.item.enableWhen.answerCoding
type: ObjectProperty
domain: QuestionnaireItemComponent.QuestionnaireItemEnableWhenComponent
range: Coding
sub property of: Questionnaire.item.enableWhen.answer

MedicationKnowledge.relatedMedicationKnowledge.reference
type: ObjectProperty
comment: Associated documentation about the associated medication knowledge.
domain: MedicationKnowledgeRelatedMedicationKnowledgeComponent
range: Reference
title: Associated documentation about the associated medication knowledge

Goal.subject
type: ObjectProperty
comment: Identifies the patient, group or organization for whom the goal is being established.
domain: Goal
range: Reference
sub property of: who.focus
title: Who this goal is intended for

QuestionnaireResponse.item.item.answer.valueCoding
type: ObjectProperty
domain: QuestionnaireResponseItemComponentItem.QuestionnaireResponseItemAnswerComponent
range: Coding
sub property of: QuestionnaireResponse.item.item.answer.value

Sequence.quality.roc.numFP
type: ObjectProperty
comment: The number of false positives if the GQ score threshold was set to "score" field value.
domain: SequenceQualityComponent.SequenceQualityRocComponent
range: integer
title: Roc score false positive numbers

Contract.term.asset.valuedItem.paymentDate
type: ObjectProperty
comment: When payment is due.
domain: Contract.TermComponent.ContractAssetComponent.ValuedItemComponent
range: dateTime
title: When payment is due

Quantity.unit
type: ObjectProperty
comment: A human-readable form of the unit.
domain: Quantity
range: string
title: Unit representation

ExplanationOfBenefit.addItem.serviced
type: ObjectProperty

MedicinalProductIndication.otherTherapy.medication
type: ObjectProperty

ItemInstance.carrierAIDC
type: ObjectProperty
comment: The machine-readable AIDC string in base64 encoding. Can correspond to the UDI pattern in devices.
domain: ItemInstance
range: string
title: The machine-readable AIDC string in base64 encoding

ChargeItemDefinition.description
type: ObjectProperty
comment: A free text natural language description of the charge item definition from a consumer's perspective.
domain: ChargeItemDefinition
range: markdown
title: Natural language description of the charge item definition

InsurancePlan.network
type: ObjectProperty
comment: Reference to the network included in the health insurance product.
domain: InsurancePlan
range: Reference
title: What networks are Included

EnrollmentResponse.outcome
type: ObjectProperty
comment: Processing status: error, complete.
domain: EnrollmentResponse
range: code
title: queued | complete | error | partial

AdverseEvent.suspectEntity.causality.assessment
type: ObjectProperty
comment: Assessment of if the entity caused the event.
domain: AdverseEventSuspectEntityComponent.AdverseEventSuspectEntityCausalityComponent
range: CodeableConcept
title: Assessment of if the entity caused the event

ExplanationOfBenefit.item.sequence
type: ObjectProperty
comment: A service line number.
domain: ExplanationOfBenefit.ItemComponent
range: positiveInt
title: Service instance

Patient.ContactComponent
type: Class
comment: A contact party (e.g. guardian, partner, friend) for the patient.
subclass of: BackboneElement
subclass of: Restriction
  all values from: HumanName
  max cardinality: 1
  on property: Patient.contact.name
subclass of: Restriction
  all values from: CodeableConcept
  on property: Patient.contact.relationship
subclass of: Restriction
  all values from: Period
  max cardinality: 1
  on property: Patient.contact.period
subclass of: Restriction
  all values from: Reference
  max cardinality: 1
  on property: Patient.contact.organization
subclass of: Restriction
  all values from: code
  max cardinality: 1
  on property: Patient.contact.gender
subclass of: Restriction
  all values from: Address
  max cardinality: 1
  on property: Patient.contact.address
subclass of: Restriction
  all values from: ContactPoint
  on property: Patient.contact.telecom

MedicationStatement.dosage
type: ObjectProperty
comment: Indicates how the medication is/was or should be taken by the patient.
domain: MedicationStatement
range: Dosage
title: Details of how medication is/was taken or should be taken

VisionPrescription.dispense.note
type: ObjectProperty
comment: Notes for special requirements such as coatings and lens materials.
domain: VisionPrescriptionDispenseComponent
range: Annotation
title: Notes for coatings

Contract.term.action.performerLinkId
type: ObjectProperty
comment: Id [identifier??] of the clause or question text related to the reason type or reference of this action in the referenced form or QuestionnaireResponse.
domain: Contract.TermComponent.ActionComponent
range: string
title: Pointer to specific item

SupplyRequest.requester
type: ObjectProperty
comment: The device, practitioner, etc. who initiated the request.
domain: SupplyRequest
range: Reference
sub property of: who.author
title: Individual making the request

ElementDefinition.mapping.language
type: ObjectProperty
comment: Identifies the computable language in which mapping.map is expressed.
domain: ElementDefinitionMappingComponent
range: code
title: Computable language of mapping

RequestGroup.action.documentation
type: ObjectProperty
comment: Didactic or other informational resources associated with the action that can be provided to the CDS recipient. Information resources can include inline text commentary and links to web resources.
domain: RequestGroupActionComponent
range: RelatedArtifact
title: Supporting documentation for the intended performer of the action

SupplyRequest.parameter.valueBoolean
type: ObjectProperty
domain: SupplyRequestParameterComponent
range: boolean
sub property of: SupplyRequest.parameter.value

Medication.code
type: ObjectProperty
comment: A code (or set of codes) that specify this medication, or a textual description if no code is available. Usage note: This could be a standard medication code such as a code from RxNorm, SNOMED CT, IDMP etc. It could also be a national or local formulary code, optionally with translations to other code systems.
domain: Medication
range: CodeableConcept
sub property of: class
title: Codes that identify this medication

PractitionerRoleAvailableTimeComponent
type: Class
comment: A collection of times the practitioner is available or performing this role at the location and/or healthcareservice.
subclass of: BackboneElement
subclass of: Restriction
  all values from: time
  max cardinality: 1
  on property: PractitionerRole.availableTime.availableEndTime
subclass of: Restriction
  all values from: time
  max cardinality: 1
  on property: PractitionerRole.availableTime.availableStartTime
subclass of: Restriction
  all values from: boolean
  max cardinality: 1
  on property: PractitionerRole.availableTime.allDay
subclass of: Restriction
  all values from: code
  on property: PractitionerRole.availableTime.daysOfWeek

Attachment.title
type: ObjectProperty
comment: A label or set of text to display in place of the data.
domain: Attachment
range: string
title: Label to display in place of the data

OperationDefinition.overload.parameterName
type: ObjectProperty
comment: Name of parameter to include in overload.
domain: OperationDefinitionOverloadComponent
range: string
title: Name of parameter to include in overload

MedicinalProductClinicals.therapeuticIndication.intendedEffect
type: ObjectProperty
comment: The intended effect, aim or strategy to be achieved by the indication.
domain: MedicinalProductClinicalsTherapeuticIndicationComponent
range: CodeableConcept
title: The intended effect, aim or strategy to be achieved by the indication

CarePlan.activity.detail.code
type: ObjectProperty
comment: Detailed description of the type of planned activity; e.g. what lab test, what procedure, what kind of encounter.
domain: CarePlanActivityComponent.CarePlanActivityDetailComponent
range: CodeableConcept
title: Detail type of activity

ImmunizationRecommendation.recommendation.seriesDosesString
type: ObjectProperty
domain: ImmunizationRecommendationRecommendationComponent
range: string
sub property of: ImmunizationRecommendation.recommendation.seriesDoses

Provenance.entity.what
type: ObjectProperty
comment: Identity of the Entity used. May be a logical or physical uri and maybe absolute or relative.
domain: ProvenanceEntityComponent
range: Reference
title: Identity of entity

Substance.description
type: ObjectProperty
comment: A description of the substance - its appearance, handling requirements, and other usage notes.
domain: Substance
range: string
title: Textual description of the substance, comments

Observation.effectiveTiming
type: ObjectProperty
domain: Observation
range: Timing
sub property of: Observation.effective

ExampleScenario.instance
type: ObjectProperty
comment: Each resource and each version that is present in the workflow.
domain: ExampleScenario
range: ExampleScenarioInstanceComponent
title: Each resource and each version that is present in the workflow

MedicinalProductAuthorization.jurisdictionalAuthorization.jurisdiction
type: ObjectProperty
comment: Jurisdiction within a country.
domain: MedicinalProductAuthorizationJurisdictionalAuthorizationComponent
range: CodeableConcept
title: Jurisdiction within a country

Task.note
type: ObjectProperty
comment: Free-text information captured about the task as it progresses.
domain: Task
range: Annotation
title: Comments made about the task

Contract.term.asset
type: ObjectProperty
comment: Contract Term Asset List.
domain: Contract.TermComponent
range: Contract.TermComponent.ContractAssetComponent
title: Contract Term Asset List

AdverseEvent.suspectEntity.causality.method
type: ObjectProperty
comment: ProbabilityScale | Bayesian | Checklist.
domain: AdverseEventSuspectEntityComponent.AdverseEventSuspectEntityCausalityComponent
range: CodeableConcept
title: ProbabilityScale | Bayesian | Checklist

HealthcareService.specialty
type: ObjectProperty
comment: Collection of specialties handled by the service site. This is more of a medical term.
domain: HealthcareService
range: CodeableConcept
title: Specialties handled by the HealthcareService

SpecimenDefinitionSpecimenToLabComponent.SpecimenDefinitionSpecimenToLabHandlingComponent
type: Class
comment: Set of instructions for conservation/transport of the specimen at a defined temperature interval, prior the testing process.
subclass of: BackboneElement
subclass of: Restriction
  all values from: string
  max cardinality: 1
  on property: SpecimenDefinition.specimenToLab.handling.instruction
subclass of: Restriction
  all values from: string
  max cardinality: 1
  on property: SpecimenDefinition.specimenToLab.handling.lightExposure
subclass of: Restriction
  all values from: Duration
  max cardinality: 1
  on property: SpecimenDefinition.specimenToLab.handling.maxDuration
subclass of: Restriction
  all values from: Range
  max cardinality: 1
  on property: SpecimenDefinition.specimenToLab.handling.tempRange
subclass of: Restriction
  all values from: CodeableConcept
  max cardinality: 1
  on property: SpecimenDefinition.specimenToLab.handling.conditionSet

Questionnaire.status
type: ObjectProperty
comment: The status of this questionnaire. Enables tracking the life-cycle of the content.
domain: Questionnaire
range: code
sub property of: status
title: draft | active | retired | unknown

PaymentReconciliation.request
type: ObjectProperty
comment: Original request resource reference.
domain: PaymentReconciliation
range: Reference
sub property of: why
title: Claim reference

OperationDefinition.parameter.targetProfile
type: ObjectProperty
comment: Used when the type is "Reference" or "canonical", and identifies a profile structure or implementation Guide that applies to the target of the reference this parameter refers to. If any profiles are specified, then the content must conform to at least one of them. The URL can be a local reference - to a contained StructureDefinition, or a reference to another StructureDefinition or Implementation Guide by a canonical URL. When an implementation guide is specified, the target resource SHALL conform to at least one profile defined in the implementation guide.
domain: OperationDefinitionParameterComponent
range: canonical
title: If type is Reference | canonical, allowed targets

RelatedArtifact.display
type: ObjectProperty
comment: A brief description of the document or knowledge resource being referenced, suitable for display to a consumer.
domain: RelatedArtifact
range: string
title: Brief description of the related artifact

Contract.term.group.type
type: ObjectProperty
comment: A legal clause or condition contained within a contract that requires one or both parties to perform a particular requirement by some specified time or prevents one or both parties from performing a particular requirement by some specified time.
domain: Contract.TermComponentTerm
range: CodeableConcept
sub property of: what
title: Contract Term Type or Form

MessageDefinition.allowedResponse.message
type: ObjectProperty
comment: A reference to the message definition that must be adhered to by this supported response.
domain: MessageDefinitionAllowedResponseComponent
range: canonical
title: Reference to allowed message definition response

ChargeItem.performer
type: ObjectProperty
comment: Indicates who or what performed or participated in the charged service.
domain: ChargeItem
range: ChargeItemPerformerComponent
title: Who performed charged service

ImagingStudy.series.numberOfInstances
type: ObjectProperty
comment: Number of SOP Instances in the Study. The value given may be larger than the number of instance elements this resource contains due to resource availability, security, or other factors. This element should be present if any instance elements are present.
domain: ImagingStudySeriesComponent
range: unsignedInt
title: Number of Series Related Instances

TestReport.test.action
type: ObjectProperty
comment: Action would contain either an operation or an assertion.
domain: TestReportTestComponent
range: TestReportTestComponent.TestActionComponent
title: A test operation or assert that was performed

Contract.term.group.action.occurrence
type: ObjectProperty

MedicinalProductClinicals.contraindication.therapeuticIndication.diseaseSymptomProcedure
type: ObjectProperty
comment: The disease, symptom or procedure that is the indication for treatment.
domain: MedicinalProductClinicalsContraindicationComponentTherapeuticIndication
range: CodeableConcept
title: The disease, symptom or procedure that is the indication for treatment

StructureMap.jurisdiction
type: ObjectProperty
comment: A legal or geographic region in which the structure map is intended to be used.
domain: StructureMap
range: CodeableConcept
title: Intended jurisdiction for structure map (if applicable)

GraphDefinitionLinkComponent.GraphDefinitionLinkTargetComponent
type: Class
comment: Potential target for the link.
subclass of: BackboneElement
subclass of: Restriction
  all values from: GraphDefinitionLinkComponent.GraphDefinitionLinkTargetComponentLink
  on property: GraphDefinition.link.target.link
subclass of: Restriction
  all values from: GraphDefinitionLinkComponent.GraphDefinitionLinkTargetComponent.GraphDefinitionLinkTargetCompartmentComponent
  on property: GraphDefinition.link.target.compartment
subclass of: Restriction
  all values from: canonical
  max cardinality: 1
  on property: GraphDefinition.link.target.profile
subclass of: Restriction
  all values from: string
  max cardinality: 1
  on property: GraphDefinition.link.target.params
subclass of: Restriction
  cardinality: 1
  on property: GraphDefinition.link.target.type
  some values from: code

DeviceRequest
type: Class
comment: Represents a request for a patient to employ a medical device. The device may be an implantable device, or an external assistive device, such as a walker.
subclass of: workflow.order
subclass of: DomainResource
subclass of: Restriction
  all values from: Reference
  on property: DeviceRequest.reasonReference
subclass of: Restriction
  all values from: Annotation
  on property: DeviceRequest.note
subclass of: Restriction
  all values from: CodeableConcept
  on property: DeviceRequest.reasonCode
subclass of: Restriction
  all values from: uri
  on property: DeviceRequest.instantiatesUri
subclass of: Restriction
  all values from: Reference
  on property: DeviceRequest.priorRequest
subclass of: Restriction
  all values from: Reference
  on property: DeviceRequest.relevantHistory
subclass of: Restriction
  all values from: Reference
  max cardinality: 1
  on property: DeviceRequest.context
subclass of: Restriction
  all values from: canonical
  on property: DeviceRequest.instantiatesCanonical
subclass of: Restriction
  all values from: Reference
  on property: DeviceRequest.insurance
subclass of: Restriction
  all values from: Reference
  on property: DeviceRequest.basedOn
subclass of: Restriction
  cardinality: 1
  on property: DeviceRequest.subject
  some values from: Reference
subclass of: Restriction
  all values from: Reference
  max cardinality: 1
  on property: DeviceRequest.requester
subclass of: Restriction
  all values from: code
  max cardinality: 1
  on property: DeviceRequest.status
subclass of: Restriction
  all values from: Identifier
  on property: DeviceRequest.identifier
subclass of: Restriction
  all values from: DeviceRequestParameterComponent
  on property: DeviceRequest.parameter
subclass of:
  union of: Restriction
    all values from: dateTime
    max cardinality: 1
    on property: DeviceRequest.occurrenceDateTime
  union of: Restriction
    all values from: Period
    max cardinality: 1
    on property: DeviceRequest.occurrencePeriod
  union of: Restriction
    all values from: Timing
    max cardinality: 1
    on property: DeviceRequest.occurrenceTiming
subclass of: Restriction
  all values from: Identifier
  max cardinality: 1
  on property: DeviceRequest.groupIdentifier
subclass of: Restriction
  all values from: Reference
  max cardinality: 1
  on property: DeviceRequest.performer
subclass of: Restriction
  all values from: code
  max cardinality: 1
  on property: DeviceRequest.priority
subclass of: Restriction
  all values from: Reference
  on property: DeviceRequest.supportingInfo
subclass of: Restriction
  all values from: dateTime
  max cardinality: 1
  on property: DeviceRequest.authoredOn
subclass of: Restriction
  all values from: CodeableConcept
  max cardinality: 1
  on property: DeviceRequest.performerType
subclass of:
  union of: Restriction
    cardinality: 1
    on property: DeviceRequest.codeReference
    some values from: Reference
  union of: Restriction
    cardinality: 1
    on property: DeviceRequest.codeCodeableConcept
    some values from: CodeableConcept
subclass of: Restriction
  cardinality: 1
  on property: DeviceRequest.intent
  some values from: code

Subscription.channel.header
type: ObjectProperty
comment: Additional headers / information to send as part of the notification.
domain: SubscriptionChannelComponent
range: string
title: Usage depends on the channel type

Measure.copyright
type: ObjectProperty
comment: A copyright statement relating to the measure and/or its contents. Copyright statements are generally legal restrictions on the use and publishing of the measure.
domain: Measure
range: markdown
title: Use and/or publishing restrictions

PlanDefinition.action.condition.expression
type: ObjectProperty
comment: An expression that returns true or false, indicating whether the condition is satisfied.
domain: PlanDefinitionActionComponent.PlanDefinitionActionConditionComponent
range: Expression
title: Boolean-valued expression

MarketingStatus
type: Class
comment: The marketing status describes the date when a medicinal product is actually put on the market or the date as of which it is no longer available.
subclass of: BackboneElement
subclass of: Restriction
  cardinality: 1
  on property: MarketingStatus.status
  some values from: CodeableConcept
subclass of: Restriction
  cardinality: 1
  on property: MarketingStatus.dateRange
  some values from: Period
subclass of: Restriction
  cardinality: 1
  on property: MarketingStatus.country
  some values from: CodeableConcept
subclass of: Restriction
  all values from: CodeableConcept
  max cardinality: 1
  on property: MarketingStatus.jurisdiction
subclass of: Restriction
  all values from: dateTime
  max cardinality: 1
  on property: MarketingStatus.restoreDate
title: The marketing status describes the date when a medicinal product is actually put on the market or the date as of which it is no longer available

Group.characteristic
type: ObjectProperty
comment: Identifies traits whose presence r absence is shared by members of the group.
domain: Group
range: GroupCharacteristicComponent
title: Include / Exclude group members by Trait

EpisodeOfCare.type
type: ObjectProperty
comment: A classification of the type of episode of care; e.g. specialist referral, disease management, type of funded care.
domain: EpisodeOfCare
range: CodeableConcept
sub property of: class
title: Type/class - e.g. specialist referral, disease management

StructureMap.group.rule.source.logMessage
type: ObjectProperty
comment: A FHIRPath expression which specifies a message to put in the transform log when content matching the source rule is found.
domain: StructureMapGroupComponent.StructureMapGroupRuleComponent.StructureMapGroupRuleSourceComponent
range: string
title: Message to put in log if source exists (FHIRPath)

PlanDefinition.action.documentation
type: ObjectProperty
comment: Didactic or other informational resources associated with the action that can be provided to the CDS recipient. Information resources can include inline text commentary and links to web resources.
domain: PlanDefinitionActionComponent
range: RelatedArtifact
title: Supporting documentation for the intended performer of the action

MedicinalProductClinicals.contraindication.disease
type: ObjectProperty
comment: The disease, symptom or procedure for the contraindication.
domain: MedicinalProductClinicalsContraindicationComponent
range: CodeableConcept
title: The disease, symptom or procedure for the contraindication

ConceptMap.experimental
type: ObjectProperty
comment: A Boolean value to indicate that this concept map is authored for testing purposes (or education/evaluation/marketing) and is not intended to be used for genuine usage.
domain: ConceptMap
range: boolean
sub property of: class
title: For testing purposes, not real usage

Contract.term.asset.answer.valueReference
type: ObjectProperty
domain: Contract.TermComponent.ContractAssetComponentAnswer
range: Reference
sub property of: Contract.term.asset.answer.value

StructureDefinition.title
type: ObjectProperty
comment: A short, descriptive, user-friendly title for the structure definition.
domain: StructureDefinition
range: string
title: Name for this structure definition (human friendly)

DetectedIssue.implicated
type: ObjectProperty
comment: Indicates the resource representing the current activity or proposed activity that is potentially problematic.
domain: DetectedIssue
range: Reference
title: Problem resource

Bundle.entry.request.ifMatch
type: ObjectProperty
comment: Only perform the operation if the Etag value matches. For more information, see the API section ["Managing Resource Contention"](http.html#concurrency).
domain: BundleEntryComponent.BundleEntryRequestComponent
range: string
title: For managing update contention

TestReport.participant.display
type: ObjectProperty
comment: The display name of the participant.
domain: TestReportParticipantComponent
range: string
title: The display name of the participant

SupplyDeliverySuppliedItemComponent
type: Class
comment: The item that is being delivered or has been supplied.
subclass of: BackboneElement
subclass of:
  union of: Restriction
    all values from: CodeableConcept
    max cardinality: 1
    on property: SupplyDelivery.suppliedItem.itemCodeableConcept
  union of: Restriction
    all values from: Reference
    max cardinality: 1
    on property: SupplyDelivery.suppliedItem.itemReference
subclass of: Restriction
  all values from: SimpleQuantity
  max cardinality: 1
  on property: SupplyDelivery.suppliedItem.quantity

SubstanceReferenceInformation.geneElement.element
type: ObjectProperty
comment: Todo.
domain: SubstanceReferenceInformationGeneElementComponent
range: Identifier
title: Todo

ExampleScenario.process.step.operation.description
type: ObjectProperty
comment: A comment to be inserted in the diagram.
domain: ExampleScenarioProcessComponent.ExampleScenarioProcessStepComponent.ExampleScenarioProcessStepOperationComponent
range: markdown
title: A comment to be inserted in the diagram

MedicationRequest.dosageInstruction
type: ObjectProperty
comment: Indicates how the medication is to be used by the patient.
domain: MedicationRequest
range: Dosage
title: How the medication should be taken

ExampleScenario.process.preConditions
type: ObjectProperty
comment: Description of initial status before the process starts.
domain: ExampleScenarioProcessComponent
range: markdown
title: Description of initial status before the process starts

ExampleScenario.process.step.process.step.operation.initiatorActive
type: ObjectProperty
comment: Whether the initiator is deactivated right after the transaction.
domain: ExampleScenarioProcessComponent.ExampleScenarioProcessStepComponentProcess.ExampleScenarioProcessStepComponent.ExampleScenarioProcessStepOperationComponent
range: boolean
title: Whether the initiator is deactivated right after the transaction

MedicinalProductClinicals
type: Class
comment: The clinical particulars - indications, contraindications etc. of a medicinal product, including for regulatory purposes.
subclass of: clinical.general
subclass of: DomainResource
subclass of: Restriction
  all values from: MedicinalProductClinicalsInteractionsComponent
  on property: MedicinalProductClinicals.interactions
subclass of: Restriction
  all values from: MedicinalProductClinicalsContraindicationComponent
  on property: MedicinalProductClinicals.contraindication
subclass of: Restriction
  on property: MedicinalProductClinicals.therapeuticIndication
  some values from: MedicinalProductClinicalsTherapeuticIndicationComponent
subclass of: Restriction
  all values from: MedicinalProductClinicalsUndesirableEffectsComponent
  on property: MedicinalProductClinicals.undesirableEffects

AllergyIntolerance.onsetPeriod
type: ObjectProperty
domain: AllergyIntolerance
range: Period
sub property of: AllergyIntolerance.onset

Invoice.paymentTerms
type: ObjectProperty
comment: Payment details such as banking details, period of payment, deductables, methods of payment.
domain: Invoice
range: markdown
title: Payment details

PlanDefinitionGoalComponent.PlanDefinitionGoalTargetComponent
type: Class
comment: Indicates what should be done and within what timeframe.
subclass of: BackboneElement
subclass of: Restriction
  all values from: Duration
  max cardinality: 1
  on property: PlanDefinition.goal.target.due
subclass of:
  union of: Restriction
    all values from: Quantity
    max cardinality: 1
    on property: PlanDefinition.goal.target.detailQuantity
  union of: Restriction
    all values from: Range
    max cardinality: 1
    on property: PlanDefinition.goal.target.detailRange
  union of: Restriction
    all values from: CodeableConcept
    max cardinality: 1
    on property: PlanDefinition.goal.target.detailCodeableConcept
subclass of: Restriction
  all values from: CodeableConcept
  max cardinality: 1
  on property: PlanDefinition.goal.target.measure

MedicationKnowledge.drugCharacteristic.valueCodeableConcept
type: ObjectProperty
domain: MedicationKnowledgeDrugCharacteristicComponent
range: CodeableConcept
sub property of: MedicationKnowledge.drugCharacteristic.value

MedicationRequest.category
type: ObjectProperty
comment: Indicates the type of medication request (for example, where the medication is expected to be consumed or administered (i.e. inpatient or outpatient)).
domain: MedicationRequest
range: CodeableConcept
sub property of: class
title: Type of medication usage

SubstanceReferenceInformation.target.amountRange
type: ObjectProperty
domain: SubstanceReferenceInformationTargetComponent
range: Range
sub property of: SubstanceReferenceInformation.target.amount

Group.member.inactive
type: ObjectProperty
comment: A flag to indicate that the member is no longer in the group, but previously may have been a member.
domain: GroupMemberComponent
range: boolean
title: If member is no longer in group

Person.link
type: ObjectProperty
comment: Link to a resource that concerns the same actual person.
domain: Person
range: PersonLinkComponent
title: Link to a resource that concerns the same actual person

MedicinalProductIngredient.substance.strength.referenceStrength.strength
type: ObjectProperty
comment: Strength expressed in terms of a reference substance.
domain: MedicinalProductIngredientSubstanceComponentStrength.MedicinalProductIngredientSpecifiedSubstanceStrengthReferenceStrengthComponent
range: Ratio
title: Strength expressed in terms of a reference substance

AllergyIntolerance
type: Class
comment: Risk of harmful or undesirable, physiological response which is unique to an individual and associated with exposure to a substance.
subclass of: clinical.general
subclass of: DomainResource
subclass of: Restriction
  all values from: dateTime
  max cardinality: 1
  on property: AllergyIntolerance.recordedDate
subclass of: Restriction
  cardinality: 1
  on property: AllergyIntolerance.patient
  some values from: Reference
subclass of: Restriction
  all values from: Annotation
  on property: AllergyIntolerance.note
subclass of: Restriction
  all values from: code
  on property: AllergyIntolerance.category
subclass of: Restriction
  all values from: code
  max cardinality: 1
  on property: AllergyIntolerance.type
subclass of: Restriction
  all values from: Reference
  max cardinality: 1
  on property: AllergyIntolerance.asserter
subclass of:
  union of: Restriction
    all values from: dateTime
    max cardinality: 1
    on property: AllergyIntolerance.onsetDateTime
  union of: Restriction
    all values from: Age
    max cardinality: 1
    on property: AllergyIntolerance.onsetAge
  union of: Restriction
    all values from: Period
    max cardinality: 1
    on property: AllergyIntolerance.onsetPeriod
  union of: Restriction
    all values from: Range
    max cardinality: 1
    on property: AllergyIntolerance.onsetRange
  union of: Restriction
    all values from: string
    max cardinality: 1
    on property: AllergyIntolerance.onsetString
subclass of: Restriction
  all values from: code
  max cardinality: 1
  on property: AllergyIntolerance.clinicalStatus
subclass of: Restriction
  all values from: Reference
  max cardinality: 1
  on property: AllergyIntolerance.recorder
subclass of: Restriction
  all values from: Reference
  max cardinality: 1
  on property: AllergyIntolerance.encounter
subclass of: Restriction
  all values from: AllergyIntoleranceReactionComponent
  on property: AllergyIntolerance.reaction
subclass of: Restriction
  all values from: Identifier
  on property: AllergyIntolerance.identifier
subclass of: Restriction
  all values from: CodeableConcept
  max cardinality: 1
  on property: AllergyIntolerance.code
subclass of: Restriction
  all values from: code
  max cardinality: 1
  on property: AllergyIntolerance.criticality
subclass of: Restriction
  all values from: code
  max cardinality: 1
  on property: AllergyIntolerance.verificationStatus
subclass of: Restriction
  all values from: dateTime
  max cardinality: 1
  on property: AllergyIntolerance.lastOccurrence

TestScript.variable.hint
type: ObjectProperty
comment: Displayable text string with hint help information to the user when entering a default value.
domain: TestScriptVariableComponent
range: string
title: Hint help text for default value to enter

CarePlan.activity.detail.reasonReference
type: ObjectProperty
comment: Indicates another resource, such as the health condition(s), whose existence justifies this request and drove the inclusion of this particular activity as part of the plan.
domain: CarePlanActivityComponent.CarePlanActivityDetailComponent
range: Reference
title: Why activity is needed

AppointmentResponse.end
type: ObjectProperty
comment: This may be either the same as the appointment request to confirm the details of the appointment, or alternately a new time to request a re-negotiation of the end time.
domain: AppointmentResponse
range: instant
sub property of: when.done
title: Time from appointment, or requested new end time

SubstanceSpecification.moiety.amount
type: ObjectProperty
comment: Quantitative value for this moiety.
domain: SubstanceSpecificationMoietyComponent
range: string
title: Quantitative value for this moiety

TestScript.teardown.action.operation.requestHeader
type: ObjectProperty
comment: Header elements would be used to set HTTP headers.
domain: TestScriptTeardownComponent.TeardownActionComponentOperation
range: TestScriptTeardownComponent.TeardownActionComponentOperation.SetupActionOperationRequestHeaderComponent
title: Each operation can have one or more header elements

MedicinalProductIngredient
type: Class
comment: An ingredient of a manufactured item or pharmaceutical product.
subclass of: DomainResource
subclass of: clinical.medication
subclass of: Restriction
  all values from: MedicinalProductIngredientSpecifiedSubstanceComponent
  on property: MedicinalProductIngredient.specifiedSubstance
subclass of: Restriction
  all values from: boolean
  max cardinality: 1
  on property: MedicinalProductIngredient.allergenicIndicator
subclass of: Restriction
  all values from: MedicinalProductIngredientSubstanceComponent
  max cardinality: 1
  on property: MedicinalProductIngredient.substance
subclass of: Restriction
  all values from: Reference
  on property: MedicinalProductIngredient.manufacturer
subclass of: Restriction
  all values from: Identifier
  max cardinality: 1
  on property: MedicinalProductIngredient.identifier
subclass of: Restriction
  cardinality: 1
  on property: MedicinalProductIngredient.role
  some values from: CodeableConcept

CapabilityStatement.implementation.description
type: ObjectProperty
comment: Information about the specific installation that this capability statement relates to.
domain: CapabilityStatementImplementationComponent
range: string
title: Describes this specific instance

ExplanationOfBenefit.insurance.focal
type: ObjectProperty
comment: The instance number of the Coverage which is the focus for adjudication. The Coverage against which the claim was adjudicated.
domain: ExplanationOfBenefit.InsuranceComponent
range: boolean
title: Is the focal Coverage

Substance.ingredient.substance
type: ObjectProperty

Identifier.value
type: ObjectProperty
comment: The portion of the identifier typically relevant to the user and which is unique within the context of the system.
domain: Identifier
range: string
title: The value that is unique

Contributor.contact
type: ObjectProperty
comment: Contact details to assist a user in finding and communicating with the contributor.
domain: Contributor
range: ContactDetail
title: Contact details of the contributor

Questionnaire.item.answerOption.valueString
type: ObjectProperty
domain: QuestionnaireItemComponent.QuestionnaireItemAnswerOptionComponent
range: string
sub property of: Questionnaire.item.answerOption.value

Encounter.hospitalization
type: ObjectProperty
comment: Details about the admission to a healthcare service.
domain: Encounter
range: EncounterHospitalizationComponent
title: Details about the admission to a healthcare service

Claim.item.sequence
type: ObjectProperty
comment: A service line number.
domain: Claim.ItemComponent
range: positiveInt
title: Service instance

TestScript.ruleset
type: ObjectProperty
comment: Contains one or more rules. Offers a way to group rules so assertions could reference the group of rules and have them all applied.
domain: TestScript
range: TestScriptRulesetComponent
title: Assert ruleset used within the test script

TerminologyCapabilities.lockedDate
type: ObjectProperty
comment: Whether the server supports lockedDate.
domain: TerminologyCapabilities
range: boolean
title: Whether lockedDate is supported

ExplanationOfBenefit.information.timingPeriod
type: ObjectProperty
domain: ExplanationOfBenefit.SupportingInformationComponent
range: Period
sub property of: ExplanationOfBenefit.information.timing

Contract.term.text
type: ObjectProperty
comment: Statement of a provision in a policy or a contract.
domain: Contract.TermComponent
range: string
title: Term Statement

MedicinalProductInteraction.interactant
type: ObjectProperty
comment: The specific medication, food or laboratory test that interacts.
domain: MedicinalProductInteraction
range: CodeableConcept
title: The specific medication, food or laboratory test that interacts

FamilyMemberHistory.ageString
type: ObjectProperty
domain: FamilyMemberHistory
range: string
sub property of: FamilyMemberHistory.age

Bundle.link
type: ObjectProperty
comment: A series of links that provide context to this bundle.
domain: Bundle
range: BundleLinkComponent
title: Links related to this Bundle

Contract.term.group.action.requesterLinkId
type: ObjectProperty
comment: Id [identifier??] of the clause or question text related to the requester of this action in the referenced form or QuestionnaireResponse.
domain: Contract.TermComponentTerm.ActionComponent
range: string
title: Pointer to specific item

Period.start
type: ObjectProperty
comment: The start of the period. The boundary is inclusive.
domain: Period
range: dateTime
title: Starting time with inclusive boundary

ClaimResponse.addItem.locationCodeableConcept
type: ObjectProperty
domain: ClaimResponse.AddedItemComponent
range: CodeableConcept
sub property of: ClaimResponse.addItem.location

Contract.type
type: ObjectProperty
comment: A high-level category for the legal instrument, whether constructed as a Contract definition, derivative, or instance in any legal state. Provides additional information about its content within the context of the Contract's scope to distinguish the kinds of systems that would be interested in the contract.
domain: Contract
range: CodeableConcept
sub property of: what
title: Legal instrument category

VerificationResult.attestation
type: ObjectProperty
comment: Information about the entity attesting to information.
domain: VerificationResult
range: VerificationResultAttestationComponent
title: Information about the entity attesting to information

AdverseEvent.suspectEntity.causality
type: ObjectProperty
comment: Information on the possible cause of the event.
domain: AdverseEventSuspectEntityComponent
range: AdverseEventSuspectEntityComponent.AdverseEventSuspectEntityCausalityComponent
title: Information on the possible cause of the event

DeviceDefinition.material
type: ObjectProperty
comment: A substance used to create the material(s) of which the device is made.
domain: DeviceDefinition
range: DeviceDefinitionMaterialComponent
title: A substance used to create the material(s) of which the device is made

TestScript.metadata.capability.validated
type: ObjectProperty
comment: Whether or not the test execution will validate the given capabilities of the server in order for this test script to execute.
domain: TestScriptMetadataComponent.TestScriptMetadataCapabilityComponent
range: boolean
title: Are the capabilities validated?

Composition.section.section.code
type: ObjectProperty
comment: A code identifying the kind of content contained within the section. This must be consistent with the section title.
domain: Composition.SectionComponentSection
range: CodeableConcept
title: Classification of section (recommended)

ExampleScenario.actor.description
type: ObjectProperty
comment: The description of the actor.
domain: ExampleScenarioActorComponent
range: markdown
title: The description of the actor

Claim.information.valueString
type: ObjectProperty
domain: Claim.SpecialConditionComponent
range: string
sub property of: Claim.information.value

ConceptMap
type: Class
comment: A statement of relationships from one set of concepts to one or more other concepts - either concepts in code systems, or data element/data element concepts, or classes in class models.
subclass of: conformance.terminology
subclass of: DomainResource
subclass of: Restriction
  all values from: markdown
  max cardinality: 1
  on property: ConceptMap.description
subclass of: Restriction
  all values from: markdown
  max cardinality: 1
  on property: ConceptMap.purpose
subclass of:
  union of: Restriction
    all values from: uri
    max cardinality: 1
    on property: ConceptMap.sourceUri
  union of: Restriction
    all values from: canonical
    max cardinality: 1
    on property: ConceptMap.sourceCanonical
subclass of: Restriction
  all values from: ConceptMapGroupComponent
  on property: ConceptMap.group
subclass of: Restriction
  all values from: string
  max cardinality: 1
  on property: ConceptMap.title
subclass of: Restriction
  all values from: uri
  max cardinality: 1
  on property: ConceptMap.url
subclass of: Restriction
  cardinality: 1
  on property: ConceptMap.status
  some values from: code
subclass of: Restriction
  all values from: string
  max cardinality: 1
  on property: ConceptMap.publisher
subclass of: Restriction
  all values from: UsageContext
  on property: ConceptMap.useContext
subclass of: Restriction
  all values from: string
  max cardinality: 1
  on property: ConceptMap.version
subclass of: Restriction
  all values from: ContactDetail
  on property: ConceptMap.contact
subclass of: Restriction
  all values from: string
  max cardinality: 1
  on property: ConceptMap.name
subclass of:
  union of: Restriction
    all values from: uri
    max cardinality: 1
    on property: ConceptMap.targetUri
  union of: Restriction
    all values from: canonical
    max cardinality: 1
    on property: ConceptMap.targetCanonical
subclass of: Restriction
  all values from: Identifier
  max cardinality: 1
  on property: ConceptMap.identifier
subclass of: Restriction
  all values from: boolean
  max cardinality: 1
  on property: ConceptMap.experimental
subclass of: Restriction
  all values from: markdown
  max cardinality: 1
  on property: ConceptMap.copyright
subclass of: Restriction
  all values from: dateTime
  max cardinality: 1
  on property: ConceptMap.date
subclass of: Restriction
  all values from: CodeableConcept
  on property: ConceptMap.jurisdiction

ParameterDefinition
type: Class
comment: The parameters to the module. This collection specifies both the input and output parameters. Input parameters are provided by the caller as part of the $evaluate operation. Output parameters are included in the GuidanceResponse.
subclass of: Element
subclass of: Restriction
  all values from: integer
  max cardinality: 1
  on property: ParameterDefinition.min
subclass of: Restriction
  all values from: canonical
  max cardinality: 1
  on property: ParameterDefinition.profile
subclass of: Restriction
  all values from: string
  max cardinality: 1
  on property: ParameterDefinition.max
subclass of: Restriction
  all values from: code
  max cardinality: 1
  on property: ParameterDefinition.name
subclass of: Restriction
  cardinality: 1
  on property: ParameterDefinition.use
  some values from: code
subclass of: Restriction
  all values from: string
  max cardinality: 1
  on property: ParameterDefinition.documentation
subclass of: Restriction
  cardinality: 1
  on property: ParameterDefinition.type
  some values from: code
title: Definition of a parameter to a module

VerificationResult.primarySource
type: ObjectProperty
comment: Information about the primary source(s) involved in validation.
domain: VerificationResult
range: VerificationResultPrimarySourceComponent
title: Information about the primary source(s) involved in validation

Contract.term.action.reasonLinkId
type: ObjectProperty
comment: Id [identifier??] of the clause or question text related to the reason type or reference of this action in the referenced form or QuestionnaireResponse.
domain: Contract.TermComponent.ActionComponent
range: string
title: Pointer to specific item

Timing.repeat.boundsDuration
type: ObjectProperty
domain: TimingRepeatComponent
range: Duration
sub property of: Timing.repeat.bounds

TestScript.setup.action.assert.minimumId
type: ObjectProperty
comment: The ID of a fixture. Asserts that the response contains at a minimum the fixture specified by minimumId.
domain: TestScriptSetupComponent.SetupActionComponent.SetupActionAssertComponent
range: string
title: Fixture Id of minimum content resource

Location.mode
type: ObjectProperty
comment: Indicates whether a resource instance represents a specific location or a class of locations.
domain: Location
range: code
sub property of: class
title: instance | kind

ExplanationOfBenefit.item.informationSequence
type: ObjectProperty
comment: Exceptions, special conditions and supporting information pplicable for this service or product line.
domain: ExplanationOfBenefit.ItemComponent
range: positiveInt
title: Applicable exception and supporting information

RequestGroup.subject
type: ObjectProperty
comment: The subject for which the request group was created.
domain: RequestGroup
range: Reference
sub property of: who.focus
title: Who the request group is about

ElementDefinition.short
type: ObjectProperty
comment: A concise description of what this element means (e.g. for use in autogenerated summaries).
domain: ElementDefinition
range: string
title: Concise definition for space-constrained presentation

StructureMap.group.rule.target
type: ObjectProperty
comment: Content to create because of this mapping rule.
domain: StructureMapGroupComponent.StructureMapGroupRuleComponent
range: StructureMapGroupComponent.StructureMapGroupRuleComponent.StructureMapGroupRuleTargetComponent
title: Content to create because of this mapping rule

ClaimResponse.addItem.adjudication.value
type: ObjectProperty
comment: A non-monetary value for example a percentage. Mutually exclusive to the amount element above.
domain: ClaimResponse.AddedItemComponentAdjudication
range: decimal
title: Non-monetary value

ResearchStudy.note
type: ObjectProperty
comment: Comments made about the study by the performer, subject or other participants.
domain: ResearchStudy
range: Annotation
title: Comments made about the study

ExampleScenario.process.step.process.step.alternative.option.description
type: ObjectProperty
comment: A human-readable description of each option.
domain: ExampleScenarioProcessComponent.ExampleScenarioProcessStepComponentProcess.ExampleScenarioProcessStepComponent.ExampleScenarioProcessStepAlternativeComponent.ExampleScenarioProcessStepAlternativeOptionComponent
range: markdown
title: A human-readable description of each option

ElementDefinition.minValuePositiveInt
type: ObjectProperty
domain: ElementDefinition
range: positiveInt
sub property of: ElementDefinition.minValue

Procedure.performer
type: ObjectProperty
comment: Limited to 'real' people rather than equipment.
domain: Procedure
range: ProcedurePerformerComponent
title: The people who performed the procedure

Contract.legal.contentAttachment
type: ObjectProperty
domain: Contract.LegalLanguageComponent
range: Attachment
sub property of: Contract.legal.content

SpecimenDefinition.specimenToLab.preference
type: ObjectProperty
comment: The preference for this type of conditioned specimen.
domain: SpecimenDefinitionSpecimenToLabComponent
range: code
title: preferred | alternate

ActivityDefinition.timingRange
type: ObjectProperty
domain: ActivityDefinition
range: Range
sub property of: ActivityDefinition.timing

QuestionnaireResponse.item.item.answer.valueDecimal
type: ObjectProperty
domain: QuestionnaireResponseItemComponentItem.QuestionnaireResponseItemAnswerComponent
range: decimal
sub property of: QuestionnaireResponse.item.item.answer.value

AppointmentResponse.identifier
type: ObjectProperty
comment: This records identifiers associated with this appointment response concern that are defined by business processes and/ or used to refer to it when a direct URL reference to the resource itself is not appropriate.
domain: AppointmentResponse
range: Identifier
sub property of: id
title: External Ids for this item

SubstancePolymer.monomerSet.startingMaterial
type: ObjectProperty
comment: Todo.
domain: SubstancePolymerMonomerSetComponent
range: SubstancePolymerMonomerSetComponent.SubstancePolymerMonomerSetStartingMaterialComponent
title: Todo

PaymentReconciliation.disposition
type: ObjectProperty
comment: A description of the status of the adjudication.
domain: PaymentReconciliation
range: string
title: Disposition Message

MedicationKnowledge.regulatory.maxDispense.quantity
type: ObjectProperty
comment: The maximum number of units of the medicaton that can be dispensed.
domain: MedicationKnowledgeRegulatoryComponent.MedicationKnowledgeRegulatoryMaxDispenseComponent
range: SimpleQuantity
title: The maximum number of units of the medicaton that can be dispensed

MedicinalProductClinicals.undesirableEffects.population.ageCodeableConcept
type: ObjectProperty
domain: MedicinalProductClinicalsUndesirableEffectsComponent.MedicinalProductClinicalsUndesirableEffectsPopulationComponent
range: CodeableConcept
sub property of: MedicinalProductClinicals.undesirableEffects.population.age

DocumentManifest.related.ref
type: ObjectProperty
comment: Related Resource to this DocumentManifest. For example, Order, ServiceRequest, Procedure, EligibilityRequest, etc.
domain: DocumentManifestRelatedComponent
range: Reference
title: Related Resource

MedicinalProductIndication.otherTherapy
type: ObjectProperty
comment: Information about the use of the medicinal product in relation to other therapies described as part of the indication.
domain: MedicinalProductIndication
range: MedicinalProductIndicationOtherTherapyComponent
title: Information about the use of the medicinal product in relation to other therapies described as part of the indication

MedicationAdministration.dosage.route
type: ObjectProperty
comment: A code specifying the route or physiological path of administration of a therapeutic agent into or onto the patient. For example, topical, intravenous, etc.
domain: MedicationAdministrationDosageComponent
range: CodeableConcept
title: Path of substance into body

MedicinalProductClinicals.interactions.incidence
type: ObjectProperty
comment: The incidence of the interaction.
domain: MedicinalProductClinicalsInteractionsComponent
range: CodeableConcept
title: The incidence of the interaction

ActivityDefinition.timingPeriod
type: ObjectProperty
domain: ActivityDefinition
range: Period
sub property of: ActivityDefinition.timing

PlanDefinition.action.priority
type: ObjectProperty
comment: Indicates how quickly the action should be addressed with respect to other actions.
domain: PlanDefinitionActionComponent
range: code
title: routine | urgent | asap | stat

PlanDefinition.version
type: ObjectProperty
comment: The identifier that is used to identify this version of the plan definition when it is referenced in a specification, model, design or instance. This is an arbitrary value managed by the plan definition author and is not expected to be globally unique. For example, it might be a timestamp (e.g. yyyymmdd) if a managed version is not available. There is also no expectation that versions can be placed in a lexicographical sequence. To provide a version consistent with the Decision Support Service specification, use the format Major.Minor.Revision (e.g. 1.0.0). For more information on versioning knowledge assets, refer to the Decision Support Service specification. Note that a version is required for non-experimental active artifacts.
domain: PlanDefinition
range: string
sub property of: id.version
title: Business version of the plan definition

MedicinalProductClinicals.contraindication.population.gender
type: ObjectProperty
comment: The gender of the specific population.
domain: MedicinalProductClinicalsContraindicationComponentPopulation
range: CodeableConcept
title: The gender of the specific population

ExplanationOfBenefit.item.detail.sequence
type: ObjectProperty
comment: A service line number.
domain: ExplanationOfBenefit.ItemComponent.DetailComponent
range: positiveInt
title: Service instance

Organization.contact.purpose
type: ObjectProperty
comment: Indicates a purpose for which the contact can be reached.
domain: OrganizationContactComponent
range: CodeableConcept
title: The type of contact

BiologicallyDerivedProductStorageComponent
type: Class
comment: Product storage.
subclass of: BackboneElement
subclass of: Restriction
  all values from: Period
  max cardinality: 1
  on property: BiologicallyDerivedProduct.storage.duration
subclass of: Restriction
  all values from: code
  max cardinality: 1
  on property: BiologicallyDerivedProduct.storage.scale
subclass of: Restriction
  all values from: decimal
  max cardinality: 1
  on property: BiologicallyDerivedProduct.storage.temperature
subclass of: Restriction
  all values from: string
  max cardinality: 1
  on property: BiologicallyDerivedProduct.storage.description

ExampleScenario.process.step.operation.receiver
type: ObjectProperty
comment: Who receives the transaction.
domain: ExampleScenarioProcessComponent.ExampleScenarioProcessStepComponent.ExampleScenarioProcessStepOperationComponent
range: string
title: Who receives the transaction

Observation.component.referenceRange
type: ObjectProperty
comment: Guidance on how to interpret the value by comparison to a normal or recommended range.
domain: ObservationComponentComponent
range: ObservationComponentComponentReferenceRange
title: Provides guide for interpretation of component result

Claim.item.locationReference
type: ObjectProperty
domain: Claim.ItemComponent
range: Reference
sub property of: Claim.item.location

MedicinalProductClinicals.therapeuticIndication.otherTherapy.medicationCodeableConcept
type: ObjectProperty
domain: MedicinalProductClinicalsTherapeuticIndicationComponent.MedicinalProductClinicalsTherapeuticIndicationOtherTherapyComponent
range: CodeableConcept
sub property of: MedicinalProductClinicals.therapeuticIndication.otherTherapy.medication

ChargeItem.quantity
type: ObjectProperty
comment: Quantity of which the charge item has been serviced.
domain: ChargeItem
range: Quantity
title: Quantity of which the charge item has been serviced

Measure.supplementalData
type: ObjectProperty
comment: The supplemental data criteria for the measure report, specified as either the name of a valid CQL expression within a referenced library, or a valid FHIR Resource Path.
domain: Measure
range: MeasureSupplementalDataComponent
title: What other data should be reported with the measure

GraphDefinition.link.target.link.path
type: ObjectProperty
comment: A FHIR expression that identifies one of FHIR References to other resources.
domain: GraphDefinitionLinkComponent.GraphDefinitionLinkTargetComponentLink
range: string
title: Path in the resource that contains the link

QuestionnaireResponse.authored
type: ObjectProperty
comment: The date and/or time that this set of answers were last changed.
domain: QuestionnaireResponse
range: dateTime
sub property of: when.recorded
title: Date the answers were gathered

ValueSet.compose.include.concept.display
type: ObjectProperty
comment: The text to display to the user for this concept in the context of this valueset. If no display is provided, then applications using the value set use the display specified for the code by the system.
domain: ValueSetComposeComponent.ConceptSetComponent.ConceptReferenceComponent
range: string
title: Text to display for this code for this value set in this valueset

MessageHeader.event
type: ObjectProperty

TestScript.test.action.operation.resource
type: ObjectProperty
comment: The type of the resource. See http://build.fhir.org/resourcelist.html.
domain: TestScriptTestComponent.TestActionComponentOperation
range: code
title: Resource type

Procedure.recorder
type: ObjectProperty
comment: Individual who recorded the record and takes responsibility for its content.
domain: Procedure
range: Reference
sub property of: who.author
title: Who recorded the procedure

StructureMap.group.rule.rule.target.parameter.valueId
type: ObjectProperty
domain: StructureMapGroupComponent.StructureMapGroupRuleComponentRule.StructureMapGroupRuleTargetComponent.StructureMapGroupRuleTargetParameterComponent
range: id
sub property of: StructureMap.group.rule.rule.target.parameter.value

MedicationRequestDispenseRequestComponent.MedicationRequestDispenseRequestInitialFillComponent
type: Class
comment: Indicates the quantity or duration for the first dispense of the medication.
subclass of: BackboneElement
subclass of: Restriction
  all values from: Duration
  max cardinality: 1
  on property: MedicationRequest.dispenseRequest.initialFill.duration
subclass of: Restriction
  all values from: SimpleQuantity
  max cardinality: 1
  on property: MedicationRequest.dispenseRequest.initialFill.quantity

MessageDefinition.purpose
type: ObjectProperty
comment: Explanation of why this message definition is needed and why it has been designed as it has.
domain: MessageDefinition
range: markdown
sub property of: why
title: Why this message definition is defined

MedicationKnowledge.preparationInstruction
type: ObjectProperty
comment: The instructions for preparing the medication.
domain: MedicationKnowledge
range: markdown
title: The instructions for preparing the medication

TestScript.rule.param.name
type: ObjectProperty
comment: Descriptive name for this parameter that matches the external assert rule parameter name.
domain: TestScriptRuleComponent.RuleParamComponent
range: string
title: Parameter name matching external assert rule parameter

PaymentNotice.identifier
type: ObjectProperty
comment: The notice business identifier.
domain: PaymentNotice
range: Identifier
sub property of: id
title: Business Identifier

Composition.date
type: ObjectProperty
comment: The composition editing time, when the composition was last logically changed by the author.
domain: Composition
range: dateTime
sub property of: when.done
title: Composition editing time

DeviceRequest.reasonCode
type: ObjectProperty
comment: Reason or justification for the use of this device.
domain: DeviceRequest
range: CodeableConcept
sub property of: why
title: Coded Reason for request

Procedure.usedCode
type: ObjectProperty
comment: Identifies coded items that were used as part of the procedure.
domain: Procedure
range: CodeableConcept
title: Coded items used during the procedure

SearchParameter.version
type: ObjectProperty
comment: The identifier that is used to identify this version of the search parameter when it is referenced in a specification, model, design or instance. This is an arbitrary value managed by the search parameter author and is not expected to be globally unique. For example, it might be a timestamp (e.g. yyyymmdd) if a managed version is not available. There is also no expectation that versions can be placed in a lexicographical sequence.
domain: SearchParameter
range: string
sub property of: id.version
title: Business version of the search parameter

Patient.identifier
type: ObjectProperty
comment: An identifier for this patient.
domain: Patient
range: Identifier
sub property of: id
title: An identifier for this patient

ExampleScenario.process.step.alternative.option.step.operation.initiator
type: ObjectProperty
comment: Who starts the transaction.
domain: ExampleScenarioProcessComponent.ExampleScenarioProcessStepComponent.ExampleScenarioProcessStepAlternativeComponent.ExampleScenarioProcessStepAlternativeOptionComponentStep.ExampleScenarioProcessStepOperationComponent
range: string
title: Who starts the transaction

TestReport.test.action.operation.message
type: ObjectProperty
comment: An explanatory message associated with the result.
domain: TestReportTestComponent.TestActionComponentOperation
range: markdown
title: A message associated with the result

Device.serialNumber
type: ObjectProperty
comment: The serial number assigned by the organization when the device was manufactured.
domain: Device
range: string
sub property of: what
title: Serial number assigned by the manufacturer

ActivityDefinition.observationResultRequirement
type: ObjectProperty
comment: Defines the observations that are expected to be produced by the action.
domain: ActivityDefinition
range: Reference
title: What observations must be produced by this action

MedicinalProduct.name.countryLanguage.language
type: ObjectProperty
comment: Language code for this name.
domain: MedicinalProductNameComponent.MedicinalProductNameCountryLanguageComponent
range: CodeableConcept
title: Language code for this name

DeviceUseStatement.recordedOn
type: ObjectProperty
comment: The time at which the statement was made/recorded.
domain: DeviceUseStatement
range: dateTime
sub property of: when.recorded
title: When statement was recorded

GuidanceResponse.occurrenceDateTime
type: ObjectProperty
comment: Indicates when the guidance response was processed.
domain: GuidanceResponse
range: dateTime
sub property of: when.done
title: When the guidance response was processed

FamilyMemberHistory.gender
type: ObjectProperty
comment: The birth sex of the family member.
domain: FamilyMemberHistory
range: CodeableConcept
title: male | female | unknown

ImplementationGuide.definition.resource.description
type: ObjectProperty
comment: A description of the reason that a resource has been included in the implementation guide.
domain: ImplementationGuideDefinitionComponent.ImplementationGuideDefinitionResourceComponent
range: string
title: Reason why included in guide

MedicationKnowledge.medicineClassification.type
type: ObjectProperty
comment: The type of category for the medication (for example, therapeutic classification, therapeutic sub-classification).
domain: MedicationKnowledgeMedicineClassificationComponent
range: CodeableConcept
title: The type of category for the medication (for example, therapeutic classification, therapeutic sub-classification)

Sequence.observedSeq
type: ObjectProperty
comment: Sequence that was observed. It is the result marked by referenceSeq along with variant records on referenceSeq. This shall starts from referenceSeq.windowStart and end by referenceSeq.windowEnd.
domain: Sequence
range: string
title: Sequence that was observed

MedicinalProductIngredientSpecifiedSubstanceComponent.MedicinalProductIngredientSpecifiedSubstanceStrengthComponent.MedicinalProductIngredientSpecifiedSubstanceStrengthReferenceStrengthComponent
type: Class
comment: Strength expressed in terms of a reference substance.
subclass of: BackboneElement
subclass of: Restriction
  all values from: CodeableConcept
  on property: MedicinalProductIngredient.specifiedSubstance.strength.referenceStrength.country
subclass of: Restriction
  all values from: string
  max cardinality: 1
  on property: MedicinalProductIngredient.specifiedSubstance.strength.referenceStrength.measurementPoint
subclass of: Restriction
  cardinality: 1
  on property: MedicinalProductIngredient.specifiedSubstance.strength.referenceStrength.strength
  some values from: Ratio
subclass of: Restriction
  all values from: CodeableConcept
  max cardinality: 1
  on property: MedicinalProductIngredient.specifiedSubstance.strength.referenceStrength.substance

StructureDefinition.version
type: ObjectProperty
comment: The identifier that is used to identify this version of the structure definition when it is referenced in a specification, model, design or instance. This is an arbitrary value managed by the structure definition author and is not expected to be globally unique. For example, it might be a timestamp (e.g. yyyymmdd) if a managed version is not available. There is also no expectation that versions can be placed in a lexicographical sequence.
domain: StructureDefinition
range: string
sub property of: id.version
title: Business version of the structure definition

StructureMap.group.rule.rule.dependent
type: ObjectProperty
comment: Which other rules to apply in the context of this rule.
domain: StructureMapGroupComponent.StructureMapGroupRuleComponentRule
range: StructureMapGroupComponent.StructureMapGroupRuleComponentRule.StructureMapGroupRuleDependentComponent
title: Which other rules to apply in the context of this rule

NutritionOrderEnteralFormulaComponent.NutritionOrderEnteralFormulaAdministrationComponent
type: Class
comment: Formula administration instructions as structured data. This repeating structure allows for changing the administration rate or volume over time for both bolus and continuous feeding. An example of this would be an instruction to increase the rate of continuous feeding every 2 hours.
subclass of: BackboneElement
subclass of:
  union of: Restriction
    all values from: SimpleQuantity
    max cardinality: 1
    on property: NutritionOrder.enteralFormula.administration.rateQuantity
  union of: Restriction
    all values from: Ratio
    max cardinality: 1
    on property: NutritionOrder.enteralFormula.administration.rateRatio
subclass of: Restriction
  all values from: SimpleQuantity
  max cardinality: 1
  on property: NutritionOrder.enteralFormula.administration.quantity
subclass of: Restriction
  all values from: Timing
  max cardinality: 1
  on property: NutritionOrder.enteralFormula.administration.schedule

EntryDefinitionRelatedEntryComponent
type: Class
comment: Used for example, to point to a substance, or to a device used to administer a medication.
subclass of: BackboneElement
subclass of: Restriction
  cardinality: 1
  on property: EntryDefinition.relatedEntry.item
  some values from: Reference
subclass of: Restriction
  cardinality: 1
  on property: EntryDefinition.relatedEntry.relationtype
  some values from: code

ActivityDefinition.lastReviewDate
type: ObjectProperty
comment: The date on which the resource content was last reviewed. Review happens periodically after approval but does not change the original approval date.
domain: ActivityDefinition
range: date
title: When the activity definition was last reviewed

GraphDefinition.link.target.link.description
type: ObjectProperty
comment: Information about why this link is of interest in this graph definition.
domain: GraphDefinitionLinkComponent.GraphDefinitionLinkTargetComponentLink
range: string
title: Why this link is specified

UserSession.context.type
type: ObjectProperty
comment: Indicates which type of context is being provided.
domain: UserSessionContextComponent
range: string
title: What type of context value

Medication.amount
type: ObjectProperty
comment: Specific amount of the drug in the packaged product. For example, when specifying a product that has the same strength (For example, Insulin glargine 100 unit per mL solution for injection), this attribute provides additional clarification of the package amount (For example, 3 mL, 10mL, etc.).
domain: Medication
range: SimpleQuantity
title: Amount of drug in package

Claim.item.detail.subDetail.net
type: ObjectProperty
comment: The quantity times the unit price for an additional service or product or charge. For example, the formula: unit Quantity * unit Price (Cost per Point) * factor Number * points = net Amount. Quantity, factor and points are assumed to be 1 if not supplied.
domain: Claim.ItemComponent.DetailComponent.SubDetailComponent
range: Money
title: Net additional item cost

Sequence.quality.roc.numTP
type: ObjectProperty
comment: The number of true positives if the GQ score threshold was set to "score" field value.
domain: SequenceQualityComponent.SequenceQualityRocComponent
range: integer
title: Roc score true positive numbers

CapabilityStatement.rest
type: ObjectProperty
comment: A definition of the restful capabilities of the solution, if any.
domain: CapabilityStatement
range: CapabilityStatementRestComponent
title: If the endpoint is a RESTful one

Appointment.description
type: ObjectProperty
comment: The brief description of the appointment as would be shown on a subject line in a meeting request, or appointment list. Detailed or expanded information should be put in the comment field.
domain: Appointment
range: string
title: Shown on a subject line in a meeting request, or appointment list

DeviceDefinition.deviceName.name
type: ObjectProperty
comment: The name of the device.
domain: DeviceDefinitionDeviceNameComponent
range: string
title: The name of the device

ConceptMap.copyright
type: ObjectProperty
comment: A copyright statement relating to the concept map and/or its contents. Copyright statements are generally legal restrictions on the use and publishing of the concept map.
domain: ConceptMap
range: markdown
title: Use and/or publishing restrictions

DeviceDefinition.property.valueQuanity
type: ObjectProperty
comment: Property value as a quantity.
domain: DeviceDefinitionPropertyComponent
range: Quantity
title: Property value as a quantity

MedicationKnowledgeKineticsComponent
type: Class
comment: The time course of drug absorption, distribution, metabolism and excretion of a medication from the body.
subclass of: BackboneElement
subclass of: Restriction
  all values from: Duration
  max cardinality: 1
  on property: MedicationKnowledge.kinetics.halfLifePeriod
subclass of: Restriction
  all values from: SimpleQuantity
  on property: MedicationKnowledge.kinetics.lethalDose50
subclass of: Restriction
  all values from: SimpleQuantity
  on property: MedicationKnowledge.kinetics.areaUnderCurve

DeviceDefinitionMaterialComponent
type: Class
comment: A substance used to create the material(s) of which the device is made.
subclass of: BackboneElement
subclass of: Restriction
  all values from: boolean
  max cardinality: 1
  on property: DeviceDefinition.material.allergenicIndicator
subclass of: Restriction
  all values from: boolean
  max cardinality: 1
  on property: DeviceDefinition.material.alternate
subclass of: Restriction
  cardinality: 1
  on property: DeviceDefinition.material.substance
  some values from: CodeableConcept

RequestGroup.action.timing
type: ObjectProperty

Library.url
type: ObjectProperty
comment: An absolute URI that is used to identify this library when it is referenced in a specification, model, design or an instance; also called its canonical identifier. This SHOULD be globally unique and SHOULD be a literal address at which at which an authoritative instance of this library is (or will be) published. This URL can be the target of a canonical reference. It SHALL remain the same when the library is stored on different servers.
domain: Library
range: uri
sub property of: id
title: Canonical identifier for this library, represented as a URI (globally unique)

CodeSystem.property.type
type: ObjectProperty
comment: The type of the property value. Properties of type "code" contain a code defined by the code system (e.g. a reference to another defined concept).
domain: CodeSystem.PropertyComponent
range: code
title: code | Coding | string | integer | boolean | dateTime | decimal

ImmunizationRecommendation.recommendation.description
type: ObjectProperty
comment: Contains the description about the protocol under which the vaccine was administered.
domain: ImmunizationRecommendationRecommendationComponent
range: string
title: Protocol details

ExplanationOfBenefit.ItemComponent
type: Class
comment: First-tier of goods and services.
subclass of: BackboneElement
subclass of: Restriction
  all values from: positiveInt
  on property: ExplanationOfBenefit.item.informationSequence
subclass of: Restriction
  all values from: CodeableConcept
  on property: ExplanationOfBenefit.item.subSite
subclass of: Restriction
  all values from: positiveInt
  on property: ExplanationOfBenefit.item.procedureSequence
subclass of: Restriction
  all values from: SimpleQuantity
  max cardinality: 1
  on property: ExplanationOfBenefit.item.quantity
subclass of: Restriction
  all values from: CodeableConcept
  max cardinality: 1
  on property: ExplanationOfBenefit.item.bodySite
subclass of: Restriction
  all values from: CodeableConcept
  max cardinality: 1
  on property: ExplanationOfBenefit.item.category
subclass of: Restriction
  cardinality: 1
  on property: ExplanationOfBenefit.item.sequence
  some values from: positiveInt
subclass of: Restriction
  all values from: positiveInt
  on property: ExplanationOfBenefit.item.noteNumber
subclass of: Restriction
  all values from: CodeableConcept
  max cardinality: 1
  on property: ExplanationOfBenefit.item.revenue
subclass of: Restriction
  all values from: decimal
  max cardinality: 1
  on property: ExplanationOfBenefit.item.factor
subclass of:
  union of: Restriction
    all values from: CodeableConcept
    max cardinality: 1
    on property: ExplanationOfBenefit.item.locationCodeableConcept
  union of: Restriction
    all values from: Address
    max cardinality: 1
    on property: ExplanationOfBenefit.item.locationAddress
  union of: Restriction
    all values from: Reference
    max cardinality: 1
    on property: ExplanationOfBenefit.item.locationReference
subclass of: Restriction
  all values from: Reference
  on property: ExplanationOfBenefit.item.encounter
subclass of: Restriction
  all values from: CodeableConcept
  on property: ExplanationOfBenefit.item.modifier
subclass of: Restriction
  all values from: Money
  max cardinality: 1
  on property: ExplanationOfBenefit.item.unitPrice
subclass of: Restriction
  all values from: CodeableConcept
  max cardinality: 1
  on property: ExplanationOfBenefit.item.billcode
subclass of: Restriction
  all values from: positiveInt
  on property: ExplanationOfBenefit.item.careTeamSequence
subclass of: Restriction
  all values from: ExplanationOfBenefit.ItemComponent.DetailComponent
  on property: ExplanationOfBenefit.item.detail
subclass of: Restriction
  all values from: Money
  max cardinality: 1
  on property: ExplanationOfBenefit.item.net
subclass of: Restriction
  all values from: ExplanationOfBenefit.ItemComponent.AdjudicationComponent
  on property: ExplanationOfBenefit.item.adjudication
subclass of: Restriction
  all values from: CodeableConcept
  on property: ExplanationOfBenefit.item.programCode
subclass of: Restriction
  all values from: positiveInt
  on property: ExplanationOfBenefit.item.diagnosisSequence
subclass of: Restriction
  all values from: Reference
  on property: ExplanationOfBenefit.item.udi
subclass of:
  union of: Restriction
    all values from: date
    max cardinality: 1
    on property: ExplanationOfBenefit.item.servicedDate
  union of: Restriction
    all values from: Period
    max cardinality: 1
    on property: ExplanationOfBenefit.item.servicedPeriod

NutritionOrder
type: Class
comment: A request to supply a diet, formula feeding (enteral) or oral nutritional supplement to a patient/resident.
subclass of: clinical.careprovision
subclass of: DomainResource
subclass of: Restriction
  cardinality: 1
  on property: NutritionOrder.dateTime
  some values from: dateTime
subclass of: Restriction
  all values from: canonical
  on property: NutritionOrder.instantiatesCanonical
subclass of: Restriction
  all values from: Annotation
  on property: NutritionOrder.note
subclass of: Restriction
  cardinality: 1
  on property: NutritionOrder.intent
  some values from: code
subclass of: Restriction
  all values from: NutritionOrderSupplementComponent
  on property: NutritionOrder.supplement
subclass of: Restriction
  all values from: Reference
  max cardinality: 1
  on property: NutritionOrder.context
subclass of: Restriction
  all values from: uri
  on property: NutritionOrder.instantiatesUri
subclass of: Restriction
  cardinality: 1
  on property: NutritionOrder.patient
  some values from: Reference
subclass of: Restriction
  all values from: Identifier
  on property: NutritionOrder.identifier
subclass of: Restriction
  all values from: Reference
  on property: NutritionOrder.allergyIntolerance
subclass of: Restriction
  all values from: NutritionOrderOralDietComponent
  max cardinality: 1
  on property: NutritionOrder.oralDiet
subclass of: Restriction
  cardinality: 1
  on property: NutritionOrder.status
  some values from: code
subclass of: Restriction
  all values from: Reference
  max cardinality: 1
  on property: NutritionOrder.orderer
subclass of: Restriction
  all values from: uri
  on property: NutritionOrder.instantiates
subclass of: Restriction
  all values from: NutritionOrderEnteralFormulaComponent
  max cardinality: 1
  on property: NutritionOrder.enteralFormula
subclass of: Restriction
  all values from: CodeableConcept
  on property: NutritionOrder.excludeFoodModifier
subclass of: Restriction
  all values from: CodeableConcept
  on property: NutritionOrder.foodPreferenceModifier

TestScript.metadata.capability.capabilities
type: ObjectProperty
comment: Minimum capabilities required of server for test script to execute successfully. If server does not meet at a minimum the referenced capability statement, then all tests in this script are skipped.
domain: TestScriptMetadataComponent.TestScriptMetadataCapabilityComponent
range: canonical
title: Required Capability Statement

TestReport.test.action.assert.result
type: ObjectProperty
comment: The result of this assertion.
domain: TestReportTestComponent.TestActionComponentAssert
range: code
title: pass | skip | fail | warning | error

MedicationDispense.substitution.responsibleParty
type: ObjectProperty
comment: The person or organization that has primary responsibility for the substitution.
domain: MedicationDispenseSubstitutionComponent
range: Reference
title: Who is responsible for the substitution

Contract.term.group.action.subject
type: ObjectProperty
comment: Entity of the action.
domain: Contract.TermComponentTerm.ActionComponent
range: Contract.TermComponentTerm.ActionComponent.ActionSubjectComponent
title: Entity of the action

HealthcareService.eligibility
type: ObjectProperty
comment: Does this service have specific eligibility requirements that need to be met in order to use the service?
domain: HealthcareService
range: CodeableConcept
title: Specific eligibility requirements required to use the service

ChargeItem.note
type: ObjectProperty
comment: Comments made about the event by the performer, subject or other participants.
domain: ChargeItem
range: Annotation
title: Comments made about the ChargeItem

ExplanationOfBenefit.payee.party
type: ObjectProperty
comment: Party to be reimbursed: Subscriber, provider, other.
domain: ExplanationOfBenefit.PayeeComponent
range: Reference
title: Party to receive the payable

Measure.group
type: ObjectProperty
comment: A group of population criteria for the measure.
domain: Measure
range: MeasureGroupComponent
title: Population criteria group

CompartmentDefinition.name
type: ObjectProperty
comment: A natural language name identifying the compartment definition. This name should be usable as an identifier for the module by machine processing applications such as code generation.
domain: CompartmentDefinition
range: string
title: Name for this compartment definition (computer friendly)

MedicinalProductAuthorization.jurisdictionalAuthorization.country
type: ObjectProperty
comment: Country of authorization.
domain: MedicinalProductAuthorizationJurisdictionalAuthorizationComponent
range: CodeableConcept
title: Country of authorization

SupplyRequest.parameter.valueRange
type: ObjectProperty
domain: SupplyRequestParameterComponent
range: Range
sub property of: SupplyRequest.parameter.value

EventDefinition.usage
type: ObjectProperty
comment: A detailed description of how the event definition is used from a clinical perspective.
domain: EventDefinition
range: string
title: Describes the clinical usage of the event definition

Contract.term.group.action.performerRole
type: ObjectProperty
comment: The type of role or competency of an individual desired or required to perform or not perform the action.
domain: Contract.TermComponentTerm.ActionComponent
range: CodeableConcept
title: Competency of the performer

Sequence
type: Class
comment: Raw data describing a biological sequence.
subclass of: DomainResource
subclass of: clinical.diagnostics
subclass of: Restriction
  all values from: SequenceVariantComponent
  on property: Sequence.variant
subclass of: Restriction
  all values from: Reference
  max cardinality: 1
  on property: Sequence.specimen
subclass of: Restriction
  all values from: integer
  max cardinality: 1
  on property: Sequence.readCoverage
subclass of: Restriction
  all values from: Reference
  max cardinality: 1
  on property: Sequence.performer
subclass of: Restriction
  all values from: Reference
  max cardinality: 1
  on property: Sequence.patient
subclass of: Restriction
  all values from: Identifier
  on property: Sequence.identifier
subclass of: Restriction
  all values from: SequenceStructureVariantComponent
  on property: Sequence.structureVariant
subclass of: Restriction
  all values from: string
  max cardinality: 1
  on property: Sequence.observedSeq
subclass of: Restriction
  all values from: Reference
  max cardinality: 1
  on property: Sequence.device
subclass of: Restriction
  all values from: Quantity
  max cardinality: 1
  on property: Sequence.quantity
subclass of: Restriction
  all values from: code
  max cardinality: 1
  on property: Sequence.type
subclass of: Restriction
  all values from: SequenceRepositoryComponent
  on property: Sequence.repository
subclass of: Restriction
  all values from: SequenceReferenceSeqComponent
  max cardinality: 1
  on property: Sequence.referenceSeq
subclass of: Restriction
  cardinality: 1
  on property: Sequence.coordinateSystem
  some values from: integer
subclass of: Restriction
  all values from: SequenceQualityComponent
  on property: Sequence.quality
subclass of: Restriction
  all values from: Reference
  on property: Sequence.pointer

ExplanationOfBenefit.outcome
type: ObjectProperty
comment: Processing outcome errror, partial or complete processing.
domain: ExplanationOfBenefit
range: code
title: queued | complete | error | partial

ExampleScenario.process.step
type: ObjectProperty
comment: Each step of the process.
domain: ExampleScenarioProcessComponent
range: ExampleScenarioProcessComponent.ExampleScenarioProcessStepComponent
title: Each step of the process

PlanDefinition.goal.target.detailCodeableConcept
type: ObjectProperty
domain: PlanDefinitionGoalComponent.PlanDefinitionGoalTargetComponent
range: CodeableConcept
sub property of: PlanDefinition.goal.target.detail

Questionnaire.item.enableWhen.answerInteger
type: ObjectProperty
domain: QuestionnaireItemComponent.QuestionnaireItemEnableWhenComponent
range: integer
sub property of: Questionnaire.item.enableWhen.answer

HumanName.period
type: ObjectProperty
comment: Indicates the period of time when this name was valid for the named person.
domain: HumanName
range: Period
title: Time period when name was/is in use

Contract.topicReference
type: ObjectProperty
domain: Contract
range: Reference
sub property of: Contract.topic

ElementDefinition
type: Class
comment: Captures constraints on each element within the resource, profile, or extension.
subclass of: BackboneElement
subclass of: Restriction
  all values from: unsignedInt
  max cardinality: 1
  on property: ElementDefinition.min
subclass of: Restriction
  all values from: Element
  max cardinality: 1
  on property: ElementDefinition.pattern
subclass of: Restriction
  all values from: ElementDefinitionBindingComponent
  max cardinality: 1
  on property: ElementDefinition.binding
subclass of:
  union of: Restriction
    all values from: date
    max cardinality: 1
    on property: ElementDefinition.maxValueDate
  union of: Restriction
    all values from: dateTime
    max cardinality: 1
    on property: ElementDefinition.maxValueDateTime
  union of: Restriction
    all values from: instant
    max cardinality: 1
    on property: ElementDefinition.maxValueInstant
  union of: Restriction
    all values from: time
    max cardinality: 1
    on property: ElementDefinition.maxValueTime
  union of: Restriction
    all values from: decimal
    max cardinality: 1
    on property: ElementDefinition.maxValueDecimal
  union of: Restriction
    all values from: integer
    max cardinality: 1
    on property: ElementDefinition.maxValueInteger
  union of: Restriction
    all values from: positiveInt
    max cardinality: 1
    on property: ElementDefinition.maxValuePositiveInt
  union of: Restriction
    all values from: unsignedInt
    max cardinality: 1
    on property: ElementDefinition.maxValueUnsignedInt
  union of: Restriction
    all values from: Quantity
    max cardinality: 1
    on property: ElementDefinition.maxValueQuantity
subclass of: Restriction
  all values from: uri
  max cardinality: 1
  on property: ElementDefinition.contentReference
subclass of: Restriction
  all values from: ElementDefinitionSlicingComponent
  max cardinality: 1
  on property: ElementDefinition.slicing
subclass of: Restriction
  all values from: string
  max cardinality: 1
  on property: ElementDefinition.label
subclass of: Restriction
  all values from: integer
  max cardinality: 1
  on property: ElementDefinition.maxLength
subclass of: Restriction
  all values from: string
  on property: ElementDefinition.alias
subclass of: Restriction
  cardinality: 1
  on property: ElementDefinition.path
  some values from: string
subclass of:
  union of: Restriction
    all values from: date
    max cardinality: 1
    on property: ElementDefinition.minValueDate
  union of: Restriction
    all values from: dateTime
    max cardinality: 1
    on property: ElementDefinition.minValueDateTime
  union of: Restriction
    all values from: instant
    max cardinality: 1
    on property: ElementDefinition.minValueInstant
  union of: Restriction
    all values from: time
    max cardinality: 1
    on property: ElementDefinition.minValueTime
  union of: Restriction
    all values from: decimal
    max cardinality: 1
    on property: ElementDefinition.minValueDecimal
  union of: Restriction
    all values from: integer
    max cardinality: 1
    on property: ElementDefinition.minValueInteger
  union of: Restriction
    all values from: positiveInt
    max cardinality: 1
    on property: ElementDefinition.minValuePositiveInt
  union of: Restriction
    all values from: unsignedInt
    max cardinality: 1
    on property: ElementDefinition.minValueUnsignedInt
  union of: Restriction
    all values from: Quantity
    max cardinality: 1
    on property: ElementDefinition.minValueQuantity
subclass of: Restriction
  all values from: boolean
  max cardinality: 1
  on property: ElementDefinition.isSummary
subclass of: Restriction
  all values from: string
  max cardinality: 1
  on property: ElementDefinition.short
subclass of: Restriction
  all values from: ElementDefinition.TypeRefComponent
  on property: ElementDefinition.type
subclass of: Restriction
  all values from: boolean
  max cardinality: 1
  on property: ElementDefinition.sliceIsConstraining
subclass of: Restriction
  all values from: markdown
  max cardinality: 1
  on property: ElementDefinition.comment
subclass of: Restriction
  all values from: boolean
  max cardinality: 1
  on property: ElementDefinition.isModifier
subclass of: Restriction
  all values from: ElementDefinitionMappingComponent
  on property: ElementDefinition.mapping
subclass of: Restriction
  all values from: ElementDefinitionBaseComponent
  max cardinality: 1
  on property: ElementDefinition.base
subclass of: Restriction
  all values from: string
  max cardinality: 1
  on property: ElementDefinition.isModifierReason
subclass of: Restriction
  all values from: markdown
  max cardinality: 1
  on property: ElementDefinition.requirements
subclass of: Restriction
  all values from: string
  max cardinality: 1
  on property: ElementDefinition.orderMeaning
subclass of: Restriction
  all values from: id
  on property: ElementDefinition.condition
subclass of: Restriction
  all values from: code
  on property: ElementDefinition.representation
subclass of: Restriction
  all values from: ElementDefinitionExampleComponent
  on property: ElementDefinition.example
subclass of: Restriction
  all values from: Coding
  on property: ElementDefinition.code
subclass of: Restriction
  all values from: Element
  max cardinality: 1
  on property: ElementDefinition.fixed
subclass of: Restriction
  all values from: string
  max cardinality: 1
  on property: ElementDefinition.sliceName
subclass of: Restriction
  all values from: string
  max cardinality: 1
  on property: ElementDefinition.max
subclass of: Restriction
  all values from: markdown
  max cardinality: 1
  on property: ElementDefinition.definition
subclass of: Restriction
  all values from: Element
  max cardinality: 1
  on property: ElementDefinition.defaultValue
subclass of: Restriction
  all values from: boolean
  max cardinality: 1
  on property: ElementDefinition.mustSupport
subclass of: Restriction
  all values from: markdown
  max cardinality: 1
  on property: ElementDefinition.meaningWhenMissing
subclass of: Restriction
  all values from: ElementDefinitionConstraintComponent
  on property: ElementDefinition.constraint
title: Definition of an element in a resource or extension

TestReportSetupComponent.SetupActionComponent.SetupActionOperationComponent
type: Class
comment: The operation performed.
subclass of: BackboneElement
subclass of: Restriction
  all values from: uri
  max cardinality: 1
  on property: TestReport.setup.action.operation.detail
subclass of: Restriction
  all values from: markdown
  max cardinality: 1
  on property: TestReport.setup.action.operation.message
subclass of: Restriction
  cardinality: 1
  on property: TestReport.setup.action.operation.result
  some values from: code

MedicinalProductPackaged.manufacturer
type: ObjectProperty
comment: Manufacturer of this Package Item.
domain: MedicinalProductPackaged
range: Reference
title: Manufacturer of this Package Item

RequestGroupActionComponent.RequestGroupActionRelatedActionComponent
type: Class
comment: A relationship to another action such as "before" or "30-60 minutes after start of".
subclass of: BackboneElement
subclass of:
  union of: Restriction
    all values from: Duration
    max cardinality: 1
    on property: RequestGroup.action.relatedAction.offsetDuration
  union of: Restriction
    all values from: Range
    max cardinality: 1
    on property: RequestGroup.action.relatedAction.offsetRange
subclass of: Restriction
  cardinality: 1
  on property: RequestGroup.action.relatedAction.relationship
  some values from: code
subclass of: Restriction
  cardinality: 1
  on property: RequestGroup.action.relatedAction.actionId
  some values from: id

PlanDefinition.experimental
type: ObjectProperty
comment: A Boolean value to indicate that this plan definition is authored for testing purposes (or education/evaluation/marketing) and is not intended to be used for genuine usage.
domain: PlanDefinition
range: boolean
sub property of: class
title: For testing purposes, not real usage

Contract.term.group.asset.typeReference
type: ObjectProperty
comment: Associated entities.
domain: Contract.TermComponentTerm.ContractAssetComponent
range: Reference
title: Associated entities

SubstanceSpecification.stoichiometric
type: ObjectProperty
comment: Chemicals may be stoichiometric or non-stoichiometric.
domain: SubstanceSpecification
range: boolean
title: Chemicals may be stoichiometric or non-stoichiometric

TestScript.useContext
type: ObjectProperty
comment: The content was developed with a focus and intent of supporting the contexts that are listed. These terms may be used to assist with indexing and searching for appropriate test script instances.
domain: TestScript
range: UsageContext
title: The context that the content is intended to support

ElementDefinition.constraint.source
type: ObjectProperty
comment: A reference to the original source of the constraint, for traceability purposes.
domain: ElementDefinitionConstraintComponent
range: canonical
title: Reference to original source of constraint

PlanDefinition.action.action.reason
type: ObjectProperty
comment: A description of why this action is necessary or appropriate.
domain: PlanDefinitionActionComponentAction
range: CodeableConcept
title: Why the action should be performed

MedicinalProductDeviceSpec.material.alternate
type: ObjectProperty
comment: Indicates an alternative material of the device.
domain: MedicinalProductDeviceSpecMaterialComponent
range: boolean
title: Indicates an alternative material of the device

EventDefinition.relatedArtifact
type: ObjectProperty
comment: Related resources such as additional documentation, justification, or bibliographic references.
domain: EventDefinition
range: RelatedArtifact
title: Additional documentation, citations, etc.

Device.patient
type: ObjectProperty
comment: Patient information, If the device is affixed to a person.
domain: Device
range: Reference
sub property of: who.focus
title: Patient to whom Device is affixed

RequestGroup.action.action.timingAge
type: ObjectProperty
domain: RequestGroupActionComponentAction
range: Age
sub property of: RequestGroup.action.action.timing

RequestGroup.action.action.documentation
type: ObjectProperty
comment: Didactic or other informational resources associated with the action that can be provided to the CDS recipient. Information resources can include inline text commentary and links to web resources.
domain: RequestGroupActionComponentAction
range: RelatedArtifact
title: Supporting documentation for the intended performer of the action

MedicinalProductIndication.population.ageRange
type: ObjectProperty
domain: MedicinalProductIndicationPopulationComponent
range: Range
sub property of: MedicinalProductIndication.population.age

DocumentManifest.status
type: ObjectProperty
comment: The status of this document manifest.
domain: DocumentManifest
range: code
sub property of: status
title: current | superseded | entered-in-error

TerminologyCapabilities.codeSystem.subsumption
type: ObjectProperty
comment: True if subsumption is supported for this version of the code system.
domain: TerminologyCapabilitiesCodeSystemComponent
range: boolean
title: Whether subsumption is supported

Measure.group.description
type: ObjectProperty
comment: The human readable description of this population group.
domain: MeasureGroupComponent
range: string
title: Summary description

MedicinalProductClinicals.contraindication.otherTherapy.medicationReference
type: ObjectProperty
domain: MedicinalProductClinicalsContraindicationComponentOtherTherapy
range: Reference
sub property of: MedicinalProductClinicals.contraindication.otherTherapy.medication

ClaimResponse.addItem.programCode
type: ObjectProperty
comment: For programs which require reason codes for the inclusion or covering of this billed item under the program or sub-program.
domain: ClaimResponse.AddedItemComponent
range: CodeableConcept
title: Program specific reason for item inclusion

Subscription.channel.payload
type: ObjectProperty
comment: The mime type to send the payload in - either application/fhir+xml, or application/fhir+json. If the payload is not present, then there is no payload in the notification, just a notification.
domain: SubscriptionChannelComponent
range: string
title: MIME type to send, or omit for no payload

DocumentReference.relatesTo.code
type: ObjectProperty
comment: The type of relationship that this document has with anther document.
domain: DocumentReferenceRelatesToComponent
range: code
title: replaces | transforms | signs | appends

RiskAssessment.prediction
type: ObjectProperty
comment: Describes the expected outcome for the subject.
domain: RiskAssessment
range: RiskAssessmentPredictionComponent
title: Outcome predicted

Contract.term.offer.answer.valueDecimal
type: ObjectProperty
domain: Contract.TermComponent.ContractOfferComponent.AnswerComponent
range: decimal
sub property of: Contract.term.offer.answer.value

Specimen.collection.method
type: ObjectProperty
comment: A coded value specifying the technique that is used to perform the procedure.
domain: SpecimenCollectionComponent
range: CodeableConcept
title: Technique used to perform collection

ElementDefinition.example.value
type: ObjectProperty
domain: ElementDefinitionExampleComponent
range: Element

RequestGroup.action.timingRange
type: ObjectProperty
domain: RequestGroupActionComponent
range: Range
sub property of: RequestGroup.action.timing

MedicationKnowledge.ingredient
type: ObjectProperty
comment: Identifies a particular constituent of interest in the product.
domain: MedicationKnowledge
range: MedicationKnowledgeIngredientComponent
title: Active or inactive ingredient

Contract.contentDefinition
type: ObjectProperty
comment: Precusory content developed with a focus and intent of supporting the formation a Contract instance, which may be associated with and transformable into a Contract.
domain: Contract
range: Contract.ContentDefinitionComponent
title: Contract precursor content

Questionnaire.item.enableWhen
type: ObjectProperty
comment: A constraint indicating that this item should only be enabled (displayed/allow answers to be captured) when the specified condition is true.
domain: QuestionnaireItemComponent
range: QuestionnaireItemComponent.QuestionnaireItemEnableWhenComponent
title: Only allow data when

MedicationKnowledgeAdministrationGuidelinesComponent.MedicationKnowledgeAdministrationGuidelinesDosageComponent
type: Class
comment: Dosage for the medication for the specific guidelines.
subclass of: BackboneElement
subclass of: Restriction
  on property: MedicationKnowledge.administrationGuidelines.dosage.dosage
  some values from: Dosage
subclass of: Restriction
  cardinality: 1
  on property: MedicationKnowledge.administrationGuidelines.dosage.type
  some values from: CodeableConcept

CarePlan.activity.progress
type: ObjectProperty
comment: Notes about the adherence/status/progress of the activity.
domain: CarePlanActivityComponent
range: Annotation
title: Comments about the activity status/progress

ExplanationOfBenefit.addItem.servicedDate
type: ObjectProperty
domain: ExplanationOfBenefit.AddedItemComponent
range: date
sub property of: ExplanationOfBenefit.addItem.serviced

Sequence.pointer
type: ObjectProperty
comment: Pointer to next atomic sequence which at most contains one variant.
domain: Sequence
range: Reference
title: Pointer to next atomic sequence

Media.width
type: ObjectProperty
comment: Width of the image in pixels (photo/video).
domain: Media
range: positiveInt
title: Width of the image in pixels (photo/video)

SubstanceReferenceInformation.relationship.source
type: ObjectProperty
comment: Todo.
domain: SubstanceReferenceInformationRelationshipComponent
range: Reference
title: Todo

CoverageEligibilityRequest.priority
type: ObjectProperty
comment: Immediate (STAT), best effort (NORMAL), deferred (DEFER).
domain: CoverageEligibilityRequest
range: CodeableConcept
sub property of: class
title: Desired processing priority

DeviceRequest.supportingInfo
type: ObjectProperty
comment: Additional clinical information about the patient that may influence the request fulfilment. For example, this may include where on the subject's body the device will be used (i.e. the target site).
domain: DeviceRequest
range: Reference
title: Additional clinical information

TestScript.test.action.assert.minimumId
type: ObjectProperty
comment: The ID of a fixture. Asserts that the response contains at a minimum the fixture specified by minimumId.
domain: TestScriptTestComponent.TestActionComponentAssert
range: string
title: Fixture Id of minimum content resource

ExplanationOfBenefit.processNote.number
type: ObjectProperty
comment: An integer associated with each note which may be referred to from each service line item.
domain: ExplanationOfBenefit.NoteComponent
range: positiveInt
title: Sequence number for this note

Invoice.participant
type: ObjectProperty
comment: Indicates who or what performed or participated in the charged service.
domain: Invoice
range: InvoiceParticipantComponent
title: Participant in creation of this Invoice

Coding.userSelected
type: ObjectProperty
comment: Indicates that this coding was chosen by a user directly - e.g. off a pick list of available items (codes or displays).
domain: Coding
range: boolean
title: If this coding was chosen directly by the user

Questionnaire.item.item.enableWhen.answerCoding
type: ObjectProperty
domain: QuestionnaireItemComponentItem.QuestionnaireItemEnableWhenComponent
range: Coding
sub property of: Questionnaire.item.item.enableWhen.answer

TestScript.test.action.assert.navigationLinks
type: ObjectProperty
comment: Whether or not the test execution performs validation on the bundle navigation links.
domain: TestScriptTestComponent.TestActionComponentAssert
range: boolean
title: Perform validation on navigation links?

ExampleScenario.process.step.alternative.option.step.operation.initiatorActive
type: ObjectProperty
comment: Whether the initiator is deactivated right after the transaction.
domain: ExampleScenarioProcessComponent.ExampleScenarioProcessStepComponent.ExampleScenarioProcessStepAlternativeComponent.ExampleScenarioProcessStepAlternativeOptionComponentStep.ExampleScenarioProcessStepOperationComponent
range: boolean
title: Whether the initiator is deactivated right after the transaction

CapabilityStatementRestComponent.CapabilityStatementRestResourceComponent.CapabilityStatementRestResourceOperationComponent
type: Class
comment: Definition of an operation or a named query together with its parameters and their meaning and type. Consult the definition of the operation for details about how to invoke the operation, and the parameters.
subclass of: BackboneElement
subclass of: Restriction
  all values from: markdown
  max cardinality: 1
  on property: CapabilityStatement.rest.resource.operation.documentation
subclass of: Restriction
  cardinality: 1
  on property: CapabilityStatement.rest.resource.operation.definition
  some values from: canonical
subclass of: Restriction
  cardinality: 1
  on property: CapabilityStatement.rest.resource.operation.name
  some values from: string

SpecimenDefinition.specimenToLab.handling
type: ObjectProperty
comment: Set of instructions for conservation/transport of the specimen at a defined temperature interval, prior the testing process.
domain: SpecimenDefinitionSpecimenToLabComponent
range: SpecimenDefinitionSpecimenToLabComponent.SpecimenDefinitionSpecimenToLabHandlingComponent
title: Specimen handling before testing

RiskAssessment.prediction.qualitativeRisk
type: ObjectProperty
comment: Indicates how likely the outcome is (in the specified timeframe), expressed as a qualitative value (e.g. low, medium, or high).
domain: RiskAssessmentPredictionComponent
range: CodeableConcept
title: Likelihood of specified outcome as a qualitative value

MedicinalProductClinicals.contraindication.therapeuticIndication.population.physiologicalCondition
type: ObjectProperty
comment: The existing physiological conditions of the specific population to which this applies.
domain: MedicinalProductClinicalsContraindicationComponentTherapeuticIndicationPopulation
range: CodeableConcept
title: The existing physiological conditions of the specific population to which this applies

DeviceDefinition.modelNumber
type: ObjectProperty
comment: The model number for the device.
domain: DeviceDefinition
range: string
sub property of: what
title: The model number for the device

Narrative.div
type: DatatypeProperty
comment: The actual narrative content, a stripped down version of XHTML.
domain: Narrative
range: http://hl7.org/fhir/xhtml
title: Limited xhtml content

Sequence.structureVariant.length
type: ObjectProperty
comment: Length of the variant choromosome.
domain: SequenceStructureVariantComponent
range: integer
title: Structural Variant Length

TestScript.setup.action.assert.expression
type: ObjectProperty
comment: The FHIRPath expression to be evaluated against the request or response message contents - HTTP headers and payload.
domain: TestScriptSetupComponent.SetupActionComponent.SetupActionAssertComponent
range: string
title: The FHIRPath expression to be evaluated

Observation.component.valueCodeableConcept
type: ObjectProperty
domain: ObservationComponentComponent
range: CodeableConcept
sub property of: Observation.component.value

MedicinalProductUndesirableEffect
type: Class
comment: Describe the undesirable effects of the medicinal product.
subclass of: DomainResource
subclass of: clinical.general
subclass of: Restriction
  all values from: CodeableConcept
  max cardinality: 1
  on property: MedicinalProductUndesirableEffect.frequencyOfOccurrence
subclass of: Restriction
  all values from: MedicinalProductUndesirableEffectPopulationComponent
  on property: MedicinalProductUndesirableEffect.population
subclass of: Restriction
  all values from: CodeableConcept
  max cardinality: 1
  on property: MedicinalProductUndesirableEffect.symptomConditionEffect
subclass of: Restriction
  all values from: CodeableConcept
  max cardinality: 1
  on property: MedicinalProductUndesirableEffect.classification
subclass of: Restriction
  all values from: Reference
  on property: MedicinalProductUndesirableEffect.subject

MedicationDispense.performer.actor
type: ObjectProperty
comment: The device, practitioner, etc. who performed the action. It should be assumed that the actor is the dispenser of the medication.
domain: MedicationDispensePerformerComponent
range: Reference
title: Individual who was performing

OperationDefinition.parameter.part.referencedFrom
type: ObjectProperty
comment: Identifies other resource parameters within the operation invocation that are expected to resolve to this resource.
domain: OperationDefinitionParameterComponentParameter
range: OperationDefinitionParameterComponentParameter.OperationDefinitionParameterReferencedFromComponent
title: References to this parameter

ExampleScenario.process.step.alternative.option.step
type: ObjectProperty
comment: What happens in each alternative option.
domain: ExampleScenarioProcessComponent.ExampleScenarioProcessStepComponent.ExampleScenarioProcessStepAlternativeComponent.ExampleScenarioProcessStepAlternativeOptionComponent
range: ExampleScenarioProcessComponent.ExampleScenarioProcessStepComponent.ExampleScenarioProcessStepAlternativeComponent.ExampleScenarioProcessStepAlternativeOptionComponentStep
title: What happens in each alternative option

MedicationKnowledge.relatedMedicationKnowledge.type
type: ObjectProperty
comment: The category of the associated medication knowledge reference.
domain: MedicationKnowledgeRelatedMedicationKnowledgeComponent
range: CodeableConcept
title: Category of medicationKnowledge

ClinicalImpression.finding.basis
type: ObjectProperty
comment: Which investigations support finding or diagnosis.
domain: ClinicalImpressionFindingComponent
range: string
title: Which investigations support finding

Contract.term.group.offer.answer.valueCoding
type: ObjectProperty
domain: Contract.TermComponentTerm.ContractOfferComponent.AnswerComponent
range: Coding
sub property of: Contract.term.group.offer.answer.value

GraphDefinition.link.target.link.target.compartment.description
type: ObjectProperty
comment: Documentation for FHIRPath expression.
domain: GraphDefinitionLinkComponent.GraphDefinitionLinkTargetComponentLink.GraphDefinitionLinkTargetComponent.GraphDefinitionLinkTargetCompartmentComponent
range: string
title: Documentation for FHIRPath expression

SubstanceReferenceInformation.relationship.substance
type: ObjectProperty

AdverseEvent.suspectEntity.causality.author
type: ObjectProperty
comment: AdverseEvent.suspectEntity.causalityAuthor.
domain: AdverseEventSuspectEntityComponent.AdverseEventSuspectEntityCausalityComponent
range: Reference
title: AdverseEvent.suspectEntity.causalityAuthor

Endpoint.period
type: ObjectProperty
comment: The interval during which the endpoint is expected to be operational.
domain: Endpoint
range: Period
sub property of: when.done
title: Interval the endpoint is expected to be operational

Contract.term.securityLabel.control
type: ObjectProperty
comment: Security label privacy tag that species the manner in which term and/or term elements are to be protected.
domain: Contract.TermComponent.SecurityLabelComponent
range: Coding
title: Handling Instructions

ImagingStudy.location
type: ObjectProperty
comment: The principal physical location where the ImagingStudy was performed.
domain: ImagingStudy
range: Reference
sub property of: where
title: Where ImagingStudy occurred

SubstanceReferenceInformation.gene.source
type: ObjectProperty
comment: Todo.
domain: SubstanceReferenceInformationGeneComponent
range: Reference
title: Todo

StructureDefinition.context.expression
type: ObjectProperty
comment: An expression that defines where an extension can be used in resources.
domain: StructureDefinitionContextComponent
range: string
title: Where the extension can be used in instances

NutritionOrder.supplement.type
type: ObjectProperty
comment: The kind of nutritional supplement product required such as a high protein or pediatric clear liquid supplement.
domain: NutritionOrderSupplementComponent
range: CodeableConcept
sub property of: what
title: Type of supplement product requested

QuestionnaireResponse.item.item.answer.valueUri
type: ObjectProperty
domain: QuestionnaireResponseItemComponentItem.QuestionnaireResponseItemAnswerComponent
range: uri
sub property of: QuestionnaireResponse.item.item.answer.value

Provenance.activity
type: ObjectProperty
comment: An activity is something that occurs over a period of time and acts upon or with entities; it may include consuming, processing, transforming, modifying, relocating, using, or generating entities.
domain: Provenance
range: CodeableConcept
sub property of: why
title: Activity that occurred

MedicinalProductPackagedBatchIdentifierComponent
type: Class
comment: Batch numbering.
subclass of: BackboneElement
subclass of: Restriction
  all values from: Identifier
  max cardinality: 1
  on property: MedicinalProductPackaged.batchIdentifier.immediatePackaging
subclass of: Restriction
  cardinality: 1
  on property: MedicinalProductPackaged.batchIdentifier.outerPackaging
  some values from: Identifier

ClaimResponse.item.detail
type: ObjectProperty
comment: The second-tier service adjudications for submitted services.
domain: ClaimResponse.ItemComponent
range: ClaimResponse.ItemComponent.ItemDetailComponent
title: Detail line items

Observation.valueRange
type: ObjectProperty
domain: Observation
range: Range
sub property of: Observation.value

ServiceRequest.occurrenceDateTime
type: ObjectProperty
domain: ServiceRequest
range: dateTime
sub property of: ServiceRequest.occurrence

Claim.ItemComponent
type: Class
comment: First tier of goods and services.
subclass of: BackboneElement
subclass of: Restriction
  all values from: CodeableConcept
  max cardinality: 1
  on property: Claim.item.bodySite
subclass of: Restriction
  all values from: SimpleQuantity
  max cardinality: 1
  on property: Claim.item.quantity
subclass of: Restriction
  all values from: positiveInt
  on property: Claim.item.informationSequence
subclass of: Restriction
  all values from: decimal
  max cardinality: 1
  on property: Claim.item.factor
subclass of: Restriction
  all values from: CodeableConcept
  on property: Claim.item.programCode
subclass of:
  union of: Restriction
    all values from: CodeableConcept
    max cardinality: 1
    on property: Claim.item.locationCodeableConcept
  union of: Restriction
    all values from: Address
    max cardinality: 1
    on property: Claim.item.locationAddress
  union of: Restriction
    all values from: Reference
    max cardinality: 1
    on property: Claim.item.locationReference
subclass of: Restriction
  all values from: CodeableConcept
  max cardinality: 1
  on property: Claim.item.category
subclass of: Restriction
  all values from: positiveInt
  on property: Claim.item.procedureSequence
subclass of: Restriction
  cardinality: 1
  on property: Claim.item.sequence
  some values from: positiveInt
subclass of: Restriction
  all values from: Reference
  on property: Claim.item.encounter
subclass of: Restriction
  all values from: Claim.ItemComponent.DetailComponent
  on property: Claim.item.detail
subclass of: Restriction
  all values from: CodeableConcept
  on property: Claim.item.modifier
subclass of: Restriction
  all values from: CodeableConcept
  max cardinality: 1
  on property: Claim.item.revenue
subclass of: Restriction
  all values from: Reference
  on property: Claim.item.udi
subclass of: Restriction
  all values from: Money
  max cardinality: 1
  on property: Claim.item.unitPrice
subclass of:
  union of: Restriction
    all values from: date
    max cardinality: 1
    on property: Claim.item.servicedDate
  union of: Restriction
    all values from: Period
    max cardinality: 1
    on property: Claim.item.servicedPeriod
subclass of: Restriction
  all values from: positiveInt
  on property: Claim.item.diagnosisSequence
subclass of: Restriction
  all values from: CodeableConcept
  max cardinality: 1
  on property: Claim.item.billcode
subclass of: Restriction
  all values from: CodeableConcept
  on property: Claim.item.subSite
subclass of: Restriction
  all values from: positiveInt
  on property: Claim.item.careTeamSequence
subclass of: Restriction
  all values from: Money
  max cardinality: 1
  on property: Claim.item.net

ConceptMap.sourceCanonical
type: ObjectProperty
domain: ConceptMap
range: canonical
sub property of: ConceptMap.source

Invoice.status
type: ObjectProperty
comment: The current state of the Invoice.
domain: Invoice
range: code
sub property of: status
title: draft | issued | balanced | cancelled | entered-in-error

ValueSet.expansion.parameter.valueUri
type: ObjectProperty
domain: ValueSetExpansionComponent.ValueSetExpansionParameterComponent
range: uri
sub property of: ValueSet.expansion.parameter.value

CommunicationRequest.payload.content
type: ObjectProperty

TestReport.setup.action.assert.message
type: ObjectProperty
comment: An explanatory message associated with the result.
domain: TestReportSetupComponent.SetupActionComponent.SetupActionAssertComponent
range: markdown
title: A message associated with the result

MedicinalProduct.specialDesignation.intendedUse
type: ObjectProperty
comment: The intended use of the product, e.g. prevention, treatment.
domain: MedicinalProductSpecialDesignationComponent
range: CodeableConcept
title: The intended use of the product, e.g. prevention, treatment

Library.status
type: ObjectProperty
comment: The status of this library. Enables tracking the life-cycle of the content.
domain: Library
range: code
sub property of: status
title: draft | active | retired | unknown

Contract.term.group.asset.securityLabelNumber
type: ObjectProperty
comment: Security labels that protects the asset.
domain: Contract.TermComponentTerm.ContractAssetComponent
range: unsignedInt
title: Asset restriction numbers

ClaimResponse.addItem.serviced
type: ObjectProperty

Flag.category
type: ObjectProperty
comment: Allows a flag to be divided into different categories like clinical, administrative etc. Intended to be used as a means of filtering which flags are displayed to particular user or in a given context.
domain: Flag
range: CodeableConcept
sub property of: class
title: Clinical, administrative, etc.

Substance.instance.quantity
type: ObjectProperty
comment: The amount of the substance.
domain: SubstanceInstanceComponent
range: SimpleQuantity
title: Amount of substance in the package

Condition.identifier
type: ObjectProperty
comment: Business identifiers assigned to this condition by the performer or other systems which remain constant as the resource is updated and propagates from server to server.
domain: Condition
range: Identifier
sub property of: id
title: External Ids for this condition

StructureMap.publisher
type: ObjectProperty
comment: The name of the organization or individual that published the structure map.
domain: StructureMap
range: string
sub property of: who.witness
title: Name of the publisher (organization or individual)

ValueSet.expansion.identifier
type: ObjectProperty
comment: An identifier that uniquely identifies this expansion of the valueset, based on a unique combination of the provided parameters, the system default parameters, and the underlying system code system versions etc. Systems may re-use the same identifier as long as those factors remain the same, and the expansion is the same, but are not required to do so. This is a business identifier.
domain: ValueSetExpansionComponent
range: uri
title: Identifies the value set expansion (business identifier)

ExampleScenario.process.step.alternative.option.step.operation.receiver
type: ObjectProperty
comment: Who receives the transaction.
domain: ExampleScenarioProcessComponent.ExampleScenarioProcessStepComponent.ExampleScenarioProcessStepAlternativeComponent.ExampleScenarioProcessStepAlternativeOptionComponentStep.ExampleScenarioProcessStepOperationComponent
range: string
title: Who receives the transaction

ConceptMap.group.element.target.display
type: ObjectProperty
comment: The display for the code. The display is only provided to help editors when editing the concept map.
domain: ConceptMapGroupComponent.SourceElementComponent.TargetElementComponent
range: string
title: Display for the code

ValueSetExpansionComponent.ValueSetExpansionParameterComponent
type: Class
comment: A parameter that controlled the expansion process. These parameters may be used by users of expanded value sets to check whether the expansion is suitable for a particular purpose, or to pick the correct expansion.
subclass of: BackboneElement
subclass of:
  union of: Restriction
    all values from: string
    max cardinality: 1
    on property: ValueSet.expansion.parameter.valueString
  union of: Restriction
    all values from: boolean
    max cardinality: 1
    on property: ValueSet.expansion.parameter.valueBoolean
  union of: Restriction
    all values from: integer
    max cardinality: 1
    on property: ValueSet.expansion.parameter.valueInteger
  union of: Restriction
    all values from: decimal
    max cardinality: 1
    on property: ValueSet.expansion.parameter.valueDecimal
  union of: Restriction
    all values from: uri
    max cardinality: 1
    on property: ValueSet.expansion.parameter.valueUri
  union of: Restriction
    all values from: code
    max cardinality: 1
    on property: ValueSet.expansion.parameter.valueCode
  union of: Restriction
    all values from: dateTime
    max cardinality: 1
    on property: ValueSet.expansion.parameter.valueDateTime
subclass of: Restriction
  cardinality: 1
  on property: ValueSet.expansion.parameter.name
  some values from: string

PlanDefinition.action.action.relatedAction.actionId
type: ObjectProperty
comment: The element id of the related action.
domain: PlanDefinitionActionComponentAction.PlanDefinitionActionRelatedActionComponent
range: id
title: What action is this related to

InvoiceLineItemComponent
type: Class
comment: Each line item represents one charge for goods ond services rendered. Details such as date, code and amount are found in the referenced ChargeItem resource.
subclass of: BackboneElement
subclass of: Restriction
  all values from: InvoiceLineItemComponent.InvoiceLineItemPriceComponentComponent
  on property: Invoice.lineItem.priceComponent
subclass of:
  union of: Restriction
    cardinality: 1
    on property: Invoice.lineItem.chargeItemReference
    some values from: Reference
  union of: Restriction
    cardinality: 1
    on property: Invoice.lineItem.chargeItemCodeableConcept
    some values from: CodeableConcept
subclass of: Restriction
  all values from: positiveInt
  max cardinality: 1
  on property: Invoice.lineItem.sequence

Subscription.channel.type
type: ObjectProperty
comment: The type of channel to send notifications on.
domain: SubscriptionChannelComponent
range: code
title: rest-hook | websocket | email | sms | message

Person.address
type: ObjectProperty
comment: One or more addresses for the person.
domain: Person
range: Address
title: One or more addresses for the person

Parameters.parameter.name
type: ObjectProperty
comment: The name of the parameter (reference to the operation definition).
domain: ParametersParameterComponent
range: string
title: Name from the definition

HealthcareService.coverageArea
type: ObjectProperty
comment: The location(s) that this service is available to (not where the service is provided).
domain: HealthcareService
range: Reference
title: Location(s) service is intended for/available to

SpecimenDefinition.identifier
type: ObjectProperty
comment: A business identifier associated with the kind of specimen.
domain: SpecimenDefinition
range: Identifier
title: Business identifier of a kind of specimen

Questionnaire.item.type
type: ObjectProperty
comment: The type of questionnaire item this is - whether text for display, a grouping of other items or a particular type of data to be captured (string, integer, coded choice, etc.).
domain: QuestionnaireItemComponent
range: code
title: group | display | boolean | decimal | integer | date | dateTime +

ValueSet.expansion.contains.display
type: ObjectProperty
comment: The recommended display for this item in the expansion.
domain: ValueSetExpansionComponent.ValueSetExpansionContainsComponent
range: string
title: User display for the concept

ClaimResponse.item.itemSequence
type: ObjectProperty
comment: A service line number.
domain: ClaimResponse.ItemComponent
range: positiveInt
title: Service instance

CoverageEligibilityResponse.servicedDate
type: ObjectProperty
domain: CoverageEligibilityResponse
range: date
sub property of: CoverageEligibilityResponse.serviced

Sequence.quality
type: ObjectProperty
comment: An experimental feature attribute that defines the quality of the feature in a quantitative way, such as a phred quality score ([SO:0001686](http://www.sequenceontology.org/browser/current_svn/term/SO:0001686)).
domain: Sequence
range: SequenceQualityComponent
title: An set of value as quality of sequence

PlanDefinition.description
type: ObjectProperty
comment: A free text natural language description of the plan definition from a consumer's perspective.
domain: PlanDefinition
range: markdown
title: Natural language description of the plan definition

ExplanationOfBenefit.benefitBalance.network
type: ObjectProperty
comment: Network designation.
domain: ExplanationOfBenefit.BenefitBalanceComponent
range: CodeableConcept
title: In or out of network

MedicinalProductClinicals.contraindication.population.ageCodeableConcept
type: ObjectProperty
domain: MedicinalProductClinicalsContraindicationComponentPopulation
range: CodeableConcept
sub property of: MedicinalProductClinicals.contraindication.population.age

ObservationDefinition.validCodedValueSet
type: ObjectProperty
comment: The set of valid coded results for the observation.
domain: ObservationDefinition
range: uri
title: Value set of valid coded values for the observation

Encounter.location.period
type: ObjectProperty
comment: Time period during which the patient was present at the location.
domain: EncounterLocationComponent
range: Period
title: Time period during which the patient was present at the location

Provenance.entity.agent
type: ObjectProperty
comment: The entity is attributed to an agent to express the agent's responsibility for that entity, possibly along with other agents. This description can be understood as shorthand for saying that the agent was responsible for the activity which generated the entity.
domain: ProvenanceEntityComponent
range: ProvenanceEntityComponentAgent
title: Entity is attributed to this agent

Composition.event.period
type: ObjectProperty
comment: The period of time covered by the documentation. There is no assertion that the documentation is a complete representation for this period, only that it documents events during this time.
domain: CompositionEventComponent
range: Period
title: The period covered by the documentation

MedicinalProductClinicals.contraindication.otherTherapy.medicationCodeableConcept
type: ObjectProperty
domain: MedicinalProductClinicalsContraindicationComponentOtherTherapy
range: CodeableConcept
sub property of: MedicinalProductClinicals.contraindication.otherTherapy.medication

MessageHeader
type: Class
comment: The header for a message exchange that is either requesting or responding to an action. The reference(s) that are the subject of the action as well as other information related to the action are typically transmitted in a bundle in which the MessageHeader resource instance is the first resource in the bundle.
subclass of: DomainResource
subclass of: infrastructure.exchange
subclass of: Restriction
  all values from: CodeableConcept
  max cardinality: 1
  on property: MessageHeader.reason
subclass of: Restriction
  all values from: MessageHeader.MessageDestinationComponent
  on property: MessageHeader.destination
subclass of: Restriction
  all values from: Reference
  max cardinality: 1
  on property: MessageHeader.enterer
subclass of: Restriction
  all values from: Reference
  on property: MessageHeader.focus
subclass of: Restriction
  all values from: canonical
  max cardinality: 1
  on property: MessageHeader.definition
subclass of: Restriction
  all values from: Reference
  max cardinality: 1
  on property: MessageHeader.author
subclass of: Restriction
  cardinality: 1
  on property: MessageHeader.source
  some values from: MessageHeader.MessageSourceComponent
subclass of:
  union of: Restriction
    cardinality: 1
    on property: MessageHeader.eventCoding
    some values from: Coding
  union of: Restriction
    cardinality: 1
    on property: MessageHeader.eventUri
    some values from: uri
subclass of: Restriction
  all values from: MessageHeaderResponseComponent
  max cardinality: 1
  on property: MessageHeader.response
subclass of: Restriction
  all values from: Reference
  max cardinality: 1
  on property: MessageHeader.responsible
subclass of: Restriction
  all values from: Reference
  max cardinality: 1
  on property: MessageHeader.sender

StructureMap.group.rule.target.element
type: ObjectProperty
comment: Field to create in the context.
domain: StructureMapGroupComponent.StructureMapGroupRuleComponent.StructureMapGroupRuleTargetComponent
range: string
title: Field to create in the context

ServiceRequest.requisition
type: ObjectProperty
comment: A shared identifier common to all service requests that were authorized more or less simultaneously by a single author, representing the composite or group identifier.
domain: ServiceRequest
range: Identifier
title: Composite Request ID

RequestGroup.action.requiredBehavior
type: ObjectProperty
comment: Defines the requiredness behavior for the action.
domain: RequestGroupActionComponent
range: code
title: must | could | must-unless-documented

ElementDefinition.maxValueInteger
type: ObjectProperty
domain: ElementDefinition
range: integer
sub property of: ElementDefinition.maxValue

PlanDefinition.publisher
type: ObjectProperty
comment: The name of the organization or individual that published the plan definition.
domain: PlanDefinition
range: string
sub property of: who.witness
title: Name of the publisher (organization or individual)

ConceptMap.group.element.target.comment
type: ObjectProperty
comment: A description of status/issues in mapping that conveys additional information not represented in the structured data.
domain: ConceptMapGroupComponent.SourceElementComponent.TargetElementComponent
range: string
title: Description of status/issues in mapping

Account.name
type: ObjectProperty
comment: Name used for the account when displaying it to humans in reports, etc.
domain: Account
range: string
sub property of: what
title: Human-readable label

CareTeam.reasonReference
type: ObjectProperty
comment: Condition(s) that this care team addresses.
domain: CareTeam
range: Reference
sub property of: why
title: Why the care team exists

Claim.identifier
type: ObjectProperty
comment: The business identifier for the instance: claim number, pre-determination or pre-authorization number.
domain: Claim
range: Identifier
sub property of: id
title: Claim number

Contract.signer.party
type: ObjectProperty
comment: Party which is a signator to this Contract.
domain: Contract.SignatoryComponent
range: Reference
sub property of: who.author
title: Contract Signatory Party

RequestGroup.reasonCode
type: ObjectProperty
comment: Describes the reason for the request group in coded or textual form.
domain: RequestGroup
range: CodeableConcept
sub property of: why
title: Why the request group is needed

Contract.term.group.offer.answer.valueAttachment
type: ObjectProperty
domain: Contract.TermComponentTerm.ContractOfferComponent.AnswerComponent
range: Attachment
sub property of: Contract.term.group.offer.answer.value

PlanDefinition.topic
type: ObjectProperty
comment: Descriptive topics related to the content of the plan definition. Topics provide a high-level categorization of the definition that can be useful for filtering and searching.
domain: PlanDefinition
range: CodeableConcept
title: E.g. Education, Treatment, Assessment

CarePlan.activity.detail.instantiatesUri
type: ObjectProperty
comment: The URL pointing to an externally maintained protocol, guideline, questionnaire or other definition that is adhered to in whole or in part by this CarePlan activity.
domain: CarePlanActivityComponent.CarePlanActivityDetailComponent
range: uri
title: Instantiates external protocol or definition

PaymentReconciliation.DetailsComponent
type: Class
comment: List of individual settlement amounts and the corresponding transaction.
subclass of: BackboneElement
subclass of: Restriction
  all values from: Reference
  max cardinality: 1
  on property: PaymentReconciliation.detail.payee
subclass of: Restriction
  all values from: Money
  max cardinality: 1
  on property: PaymentReconciliation.detail.amount
subclass of: Restriction
  all values from: Reference
  max cardinality: 1
  on property: PaymentReconciliation.detail.submitter
subclass of: Restriction
  all values from: date
  max cardinality: 1
  on property: PaymentReconciliation.detail.date
subclass of: Restriction
  all values from: Reference
  max cardinality: 1
  on property: PaymentReconciliation.detail.response
subclass of: Restriction
  all values from: Reference
  max cardinality: 1
  on property: PaymentReconciliation.detail.request
subclass of: Restriction
  cardinality: 1
  on property: PaymentReconciliation.detail.type
  some values from: CodeableConcept

Group.actual
type: ObjectProperty
comment: If true, indicates that the resource refers to a specific group of real individuals. If false, the group defines a set of intended individuals.
domain: Group
range: boolean
sub property of: class
title: Descriptive or actual

NamingSystem.uniqueId
type: ObjectProperty
comment: Indicates how the system may be identified when referenced in electronic exchange.
domain: NamingSystem
range: NamingSystemUniqueIdComponent
title: Unique identifiers used for system

Specimen.identifier
type: ObjectProperty
comment: Id for specimen.
domain: Specimen
range: Identifier
sub property of: id
title: External Identifier

ValueSet.expansion.contains.contains.designation.value
type: ObjectProperty
comment: The text value for this designation.
domain: ValueSetExpansionComponent.ValueSetExpansionContainsComponentContainsDesignation
range: string
title: The text value for this designation

Dosage.maxDosePerPeriod
type: ObjectProperty
comment: Upper limit on medication per unit of time.
domain: Dosage
range: Ratio
title: Upper limit on medication per unit of time

MedicationKnowledge.cost.type
type: ObjectProperty
comment: The category of the cost information. For example, manufacturers' cost, patient cost, claim reimbursement cost, actual acquisition cost.
domain: MedicationKnowledgeCostComponent
range: CodeableConcept
title: The category of the cost information

Contract.term.asset.valuedItem.identifier
type: ObjectProperty
comment: Identifies a Contract Valued Item instance.
domain: Contract.TermComponent.ContractAssetComponent.ValuedItemComponent
range: Identifier
title: Contract Valued Item Number

StructureMap.group.name
type: ObjectProperty
comment: A unique name for the group for the convenience of human readers.
domain: StructureMapGroupComponent
range: id
title: Human-readable label

integer
type: Class
comment: A whole number
subclass of: Primitive
subclass of: Restriction
  cardinality: 1
  on property: fhir:value
  some values from: Datatype
    on datatype: integer

ElementDefinition.label
type: ObjectProperty
comment: A single preferred label which is the text to display beside the element indicating its meaning or to use to prompt for the element in a user display or form.
domain: ElementDefinition
range: string
title: Name for element to display with or prompt for element

RelatedPerson.name
type: ObjectProperty
comment: A name associated with the person.
domain: RelatedPerson
range: HumanName
title: A name associated with the person

ExampleScenario.process.step.operation.request
type: ObjectProperty
comment: Each resource instance used by the initiator.
domain: ExampleScenarioProcessComponent.ExampleScenarioProcessStepComponent.ExampleScenarioProcessStepOperationComponent
range: ExampleScenarioProcessComponent.ExampleScenarioProcessStepComponent.ExampleScenarioProcessStepOperationComponentContainedInstance
title: Each resource instance used by the initiator

ClaimResponse.PaymentComponent
type: Class
comment: Payment details for the claim if the claim has been paid.
subclass of: BackboneElement
subclass of: Restriction
  all values from: Identifier
  max cardinality: 1
  on property: ClaimResponse.payment.identifier
subclass of: Restriction
  all values from: CodeableConcept
  max cardinality: 1
  on property: ClaimResponse.payment.adjustmentReason
subclass of: Restriction
  all values from: Money
  max cardinality: 1
  on property: ClaimResponse.payment.amount
subclass of: Restriction
  all values from: Money
  max cardinality: 1
  on property: ClaimResponse.payment.adjustment
subclass of: Restriction
  all values from: CodeableConcept
  max cardinality: 1
  on property: ClaimResponse.payment.type
subclass of: Restriction
  all values from: date
  max cardinality: 1
  on property: ClaimResponse.payment.date

MedicinalProduct.contraindication
type: ObjectProperty
comment: Clinical contraindications, reasons for not giving this.
domain: MedicinalProduct
range: Reference
title: Clinical contraindications, reasons for not giving this

ProcessResponse
type: Class
comment: This resource provides processing status, errors and notes from the processing of a resource.
subclass of: workflow.order
subclass of: DomainResource
subclass of: Restriction
  all values from: code
  max cardinality: 1
  on property: ProcessResponse.status
subclass of: Restriction
  all values from: Reference
  max cardinality: 1
  on property: ProcessResponse.request
subclass of: Restriction
  all values from: ProcessResponseProcessNoteComponent
  on property: ProcessResponse.processNote
subclass of: Restriction
  all values from: Reference
  max cardinality: 1
  on property: ProcessResponse.organization
subclass of: Restriction
  all values from: Identifier
  on property: ProcessResponse.identifier
subclass of: Restriction
  all values from: string
  max cardinality: 1
  on property: ProcessResponse.disposition
subclass of: Restriction
  all values from: CodeableConcept
  max cardinality: 1
  on property: ProcessResponse.form
subclass of: Restriction
  all values from: Reference
  on property: ProcessResponse.communicationRequest
subclass of: Restriction
  all values from: dateTime
  max cardinality: 1
  on property: ProcessResponse.created
subclass of: Restriction
  all values from: code
  max cardinality: 1
  on property: ProcessResponse.outcome
subclass of: Restriction
  all values from: Reference
  max cardinality: 1
  on property: ProcessResponse.requestProvider
subclass of: Restriction
  all values from: CodeableConcept
  on property: ProcessResponse.error

MedicinalProductPackaged.packageItem.packageItem.device
type: ObjectProperty
comment: A device accompanying a medicinal product.
domain: MedicinalProductPackagedPackageItemComponentPackageItem
range: Reference
title: A device accompanying a medicinal product

ExampleScenario.process.step.process.step.operation
type: ObjectProperty
comment: Each interaction or action.
domain: ExampleScenarioProcessComponent.ExampleScenarioProcessStepComponentProcess.ExampleScenarioProcessStepComponent
range: ExampleScenarioProcessComponent.ExampleScenarioProcessStepComponentProcess.ExampleScenarioProcessStepComponent.ExampleScenarioProcessStepOperationComponent
title: Each interaction or action

Location.alias
type: ObjectProperty
comment: A list of alternate names that the location is known as or was known as in the past.
domain: Location
range: string
title: A list of alternate names that the location is known as or was known as in the past

ClaimResponse.item.detail.subDetail.adjudication.reason
type: ObjectProperty
comment: Adjudication reason such as limit reached.
domain: ClaimResponse.ItemComponent.ItemDetailComponent.SubDetailComponentAdjudication
range: CodeableConcept
title: Explanation of Adjudication outcome

MedicinalProductClinicals.undesirableEffects.population.ageRange
type: ObjectProperty
domain: MedicinalProductClinicalsUndesirableEffectsComponent.MedicinalProductClinicalsUndesirableEffectsPopulationComponent
range: Range
sub property of: MedicinalProductClinicals.undesirableEffects.population.age

Condition.subject
type: ObjectProperty
comment: Indicates the patient or group who the condition record is associated with.
domain: Condition
range: Reference
sub property of: who.focus
title: Who has the condition?

Sequence.specimen
type: ObjectProperty
comment: Specimen used for sequencing.
domain: Sequence
range: Reference
title: Specimen used for sequencing

ElementDefinition.slicing
type: ObjectProperty
comment: Indicates that the element is sliced into a set of alternative definitions (i.e. in a structure definition, there are multiple different constraints on a single element in the base resource). Slicing can be used in any resource that has cardinality ..* on the base resource, or any resource with a choice of types. The set of slices is any elements that come after this in the element sequence that have the same path, until a shorter path occurs (the shorter path terminates the set).
domain: ElementDefinition
range: ElementDefinitionSlicingComponent
title: This element is sliced - slices follow

DeviceMetric.source
type: ObjectProperty
comment: Describes the link to the Device that this DeviceMetric belongs to and that contains administrative device information such as manufacturer, serial number, etc.
domain: DeviceMetric
range: Reference
title: Describes the link to the source Device

TestScript.variable.defaultValue
type: ObjectProperty
comment: A default, hard-coded, or user-defined value for this variable.
domain: TestScriptVariableComponent
range: string
title: Default, hard-coded, or user-defined value for this variable

Contract.term.asset.valuedItem.entity
type: ObjectProperty

ClaimResponse.addItem.subdetailSequence
type: ObjectProperty
comment: The sequence number of the addition within the line item submitted which contains the error. This value is omitted when the error is not related to an Addition.
domain: ClaimResponse.AddedItemComponent
range: positiveInt
title: Subdetail sequence number

ClaimResponse.insurance.businessArrangement
type: ObjectProperty
comment: The contract number of a business agreement which describes the terms and conditions.
domain: ClaimResponse.InsuranceComponent
range: string
title: Business agreement

ClaimResponse.item.adjudication.amount
type: ObjectProperty
comment: Monetary amount associated with the code.
domain: ClaimResponse.ItemComponent.AdjudicationComponent
range: Money
title: Monetary amount

StructureMap.group.rule.target.parameter.valueBoolean
type: ObjectProperty
domain: StructureMapGroupComponent.StructureMapGroupRuleComponent.StructureMapGroupRuleTargetComponent.StructureMapGroupRuleTargetParameterComponent
range: boolean
sub property of: StructureMap.group.rule.target.parameter.value

Condition.onsetRange
type: ObjectProperty
domain: Condition
range: Range
sub property of: Condition.onset

Group.characteristic.exclude
type: ObjectProperty
comment: If true, indicates the characteristic is one that is NOT held by members of the group.
domain: GroupCharacteristicComponent
range: boolean
title: Group includes or excludes

CodeSystem.supplements
type: ObjectProperty
comment: References the code system that this code system supplement is adding designations and properties to.
domain: CodeSystem
range: canonical
title: Code System this adds designations and properties to

Contract.term.asset.typeReference
type: ObjectProperty
comment: Associated entities.
domain: Contract.TermComponent.ContractAssetComponent
range: Reference
title: Associated entities

ExplanationOfBenefit.addItem.bodySite
type: ObjectProperty
comment: Physical service site on the patient (limb, tooth, etc.).
domain: ExplanationOfBenefit.AddedItemComponent
range: CodeableConcept
title: Service Location

MedicationRequest.authoredOn
type: ObjectProperty
comment: The date (and perhaps time) when the prescription was initially written or authored on.
domain: MedicationRequest
range: dateTime
sub property of: when.recorded
title: When request was initially authored

CoverageEligibilityResponse.purpose
type: ObjectProperty
comment: Specify whether requesting: prior authorization requirements for some service categories or billing codes; benefits for coverages specified or discovered; discovery and return of coverages for th patient; and/or validation that the specified coverage is in-force at the date/period specified or 'now' if not specified.
domain: CoverageEligibilityResponse
range: code
sub property of: class
title: auth-requirements | benefits | discovery | validation

Condition.evidence.code
type: ObjectProperty
comment: A manifestation or symptom that led to the recording of this condition.
domain: ConditionEvidenceComponent
range: CodeableConcept
sub property of: why
title: Manifestation/symptom

MessageHeader.MessageDestinationComponent
type: Class
comment: The destination application which the message is intended for.
subclass of: BackboneElement
subclass of: Restriction
  all values from: Reference
  max cardinality: 1
  on property: MessageHeader.destination.receiver
subclass of: Restriction
  cardinality: 1
  on property: MessageHeader.destination.endpoint
  some values from: url
subclass of: Restriction
  all values from: Reference
  max cardinality: 1
  on property: MessageHeader.destination.target
subclass of: Restriction
  all values from: string
  max cardinality: 1
  on property: MessageHeader.destination.name

MedicinalProductPharmaceutical.unitOfPresentation
type: ObjectProperty
comment: Todo.
domain: MedicinalProductPharmaceutical
range: CodeableConcept
title: Todo

Sequence.variant.cigar
type: ObjectProperty
comment: Extended CIGAR string for aligning the sequence with reference bases. See detailed documentation [here](http://support.illumina.com/help/SequencingAnalysisWorkflow/Content/Vault/Informatics/Sequencing_Analysis/CASAVA/swSEQ_mCA_ExtendedCIGARFormat.htm).
domain: SequenceVariantComponent
range: string
title: Extended CIGAR string for aligning the sequence with reference bases

Device.version.type
type: ObjectProperty
comment: The type of the device version.
domain: DeviceVersionComponent
range: CodeableConcept
title: The type of the device version

Observation.effectiveInstant
type: ObjectProperty
domain: Observation
range: instant
sub property of: Observation.effective

SubstanceAmount.amountType
type: ObjectProperty
comment: Most elements that require a quantitative value will also have a field called amount type. Amount type should always be specified because the actual value of the amount is often dependent on it. EXAMPLE: In capturing the actual relative amounts of substances or molecular fragments it is essential to indicate whether the amount refers to a mole ratio or weight ratio. For any given element an effort should be made to use same the amount type for all related definitional elements.
domain: SubstanceAmount
range: CodeableConcept
title: Most elements that require a quantitative value will also have a field called amount type. Amount type should always be specified because the actual value of the amount is often dependent on it. EXAMPLE: In capturing the actual relative amounts of substances or molecular fragments it is essential to indicate whether the amount refers to a mole ratio or weight ratio. For any given element an effort should be made to use same the amount type for all related definitional elements

DocumentReferenceAgentComponent
type: Class
comment: An actor taking an active role in the document.
subclass of: BackboneElement
subclass of: Restriction
  cardinality: 1
  on property: DocumentReference.agent.who
  some values from: Reference
subclass of: Restriction
  all values from: CodeableConcept
  max cardinality: 1
  on property: DocumentReference.agent.type

TerminologyCapabilitiesTranslationComponent
type: Class
comment: Information about the [ConceptMap/$translate](conceptmap-operation-translate.html) operation.
subclass of: BackboneElement
subclass of: Restriction
  cardinality: 1
  on property: TerminologyCapabilities.translation.needsMap
  some values from: boolean

Questionnaire.item.item.enableWhen.answer
type: ObjectProperty

Appointment.identifier
type: ObjectProperty
comment: This records identifiers associated with this appointment concern that are defined by business processes and/or used to refer to it when a direct URL reference to the resource itself is not appropriate (e.g. in CDA documents, or in written / printed documentation).
domain: Appointment
range: Identifier
sub property of: id
title: External Ids for this item

fhir:value
type: DatatypeProperty
title: Terminal data value

DocumentReference.agent.who
type: ObjectProperty
comment: Identifies who is responsible for adding the information to the document.
domain: DocumentReferenceAgentComponent
range: Reference
title: Who and/or what authored the document

Organization.address
type: ObjectProperty
comment: An address for the organization.
domain: Organization
range: Address
title: An address for the organization

Immunization.programEligibility
type: ObjectProperty
comment: Indicates a patient's eligibility for a funding program.
domain: Immunization
range: CodeableConcept
title: Patient eligibility for a vaccination program

AuditEvent.entity.lifecycle
type: ObjectProperty
comment: Identifier for the data life-cycle stage for the entity.
domain: AuditEventEntityComponent
range: Coding
sub property of: context
title: Life-cycle stage for the entity

CareTeam.telecom
type: ObjectProperty
comment: A central contact detail for the care team (that applies to all members).
domain: CareTeam
range: ContactPoint
title: A contact detail for the care team (that applies to all members)

TestScriptTestComponent.TestActionComponentOperation.SetupActionOperationRequestHeaderComponent
type: Class
comment: Header elements would be used to set HTTP headers.
subclass of: BackboneElement
subclass of: Restriction
  cardinality: 1
  on property: TestScript.test.action.operation.requestHeader.value
  some values from: string
subclass of: Restriction
  cardinality: 1
  on property: TestScript.test.action.operation.requestHeader.field
  some values from: string

StructureMap.group.rule.rule.source.listMode
type: ObjectProperty
comment: How to handle the list mode for this element.
domain: StructureMapGroupComponent.StructureMapGroupRuleComponentRule.StructureMapGroupRuleSourceComponent
range: code
title: first | not_first | last | not_last | only_one

ExampleScenario.process.step.process.step.process
type: ObjectProperty
comment: Nested process.
domain: ExampleScenarioProcessComponent.ExampleScenarioProcessStepComponentProcess.ExampleScenarioProcessStepComponent
range: ExampleScenarioProcessComponent.ExampleScenarioProcessStepComponentProcess.ExampleScenarioProcessStepComponentProcess
title: Nested process

RequestGroup.action.condition.language
type: ObjectProperty
comment: The media type of the language for the expression.
domain: RequestGroupActionComponent.RequestGroupActionConditionComponent
range: string
title: Language of the expression

CareTeam.participant.member
type: ObjectProperty
comment: The specific person or organization who is participating/expected to participate in the care team.
domain: CareTeamParticipantComponent
range: Reference
sub property of: who.actor
title: Who is involved

AllergyIntolerance.lastOccurrence
type: ObjectProperty
comment: Represents the date and/or time of the last known occurrence of a reaction event.
domain: AllergyIntolerance
range: dateTime
title: Date(/time) of last known occurrence of a reaction

MedicinalProductIndication.intendedEffect
type: ObjectProperty
comment: The intended effect, aim or strategy to be achieved by the indication.
domain: MedicinalProductIndication
range: CodeableConcept
title: The intended effect, aim or strategy to be achieved by the indication

MedicationKnowledge.ingredient.itemCodeableConcept
type: ObjectProperty
domain: MedicationKnowledgeIngredientComponent
range: CodeableConcept
sub property of: MedicationKnowledge.ingredient.item

DocumentReference.content
type: ObjectProperty
comment: The document and format referenced. There may be multiple content element repetitions, each with a different format.
domain: DocumentReference
range: DocumentReferenceContentComponent
title: Document referenced

ExplanationOfBenefit.item.detail.subDetail.noteNumber
type: ObjectProperty
comment: A list of note references to the notes provided below.
domain: ExplanationOfBenefit.ItemComponent.DetailComponent.SubDetailComponent
range: positiveInt
title: List of note numbers which apply

Dosage.doseAndRate.dose
type: ObjectProperty

DocumentReference.securityLabel
type: ObjectProperty
comment: A set of Security-Tag codes specifying the level of privacy/security of the Document. Note that DocumentReference.meta.security contains the security labels of the "reference" to the document, while DocumentReference.securityLabel contains a snapshot of the security labels on the document the reference refers to.
domain: DocumentReference
range: CodeableConcept
title: Document security-tags

ImplementationGuide.definition.page.page.nameUrl
type: ObjectProperty
domain: ImplementationGuideDefinitionComponent.ImplementationGuideDefinitionPageComponentPage
range: url
sub property of: ImplementationGuide.definition.page.page.name

Sequence.repository
type: ObjectProperty
comment: Configurations of the external repository. The repository shall store target's observedSeq or records related with target's observedSeq.
domain: Sequence
range: SequenceRepositoryComponent
title: External repository which contains detailed report related with observedSeq in this resource

Contract.term.group.action.contextLinkId
type: ObjectProperty
comment: Id [identifier??] of the clause or question text related to the requester of this action in the referenced form or QuestionnaireResponse.
domain: Contract.TermComponentTerm.ActionComponent
range: string
title: Pointer to specific item

Appointment.supportingInformation
type: ObjectProperty
comment: Additional information to support the appointment provided when making the appointment.
domain: Appointment
range: Reference
sub property of: context
title: Additional information to support the appointment

Contract.TermComponent.ContractOfferComponent
type: Class
comment: The matter of concern in the context of this provision of the agrement.
subclass of: BackboneElement
subclass of: Restriction
  all values from: Identifier
  on property: Contract.term.offer.identifier
subclass of: Restriction
  all values from: Reference
  max cardinality: 1
  on property: Contract.term.offer.topic
subclass of: Restriction
  all values from: CodeableConcept
  max cardinality: 1
  on property: Contract.term.offer.decision
subclass of: Restriction
  all values from: Contract.TermComponent.ContractOfferComponent.AnswerComponent
  on property: Contract.term.offer.answer
subclass of: Restriction
  all values from: string
  on property: Contract.term.offer.linkId
subclass of: Restriction
  all values from: string
  max cardinality: 1
  on property: Contract.term.offer.text
subclass of: Restriction
  all values from: CodeableConcept
  on property: Contract.term.offer.decisionMode
subclass of: Restriction
  all values from: Contract.TermComponent.ContractOfferComponent.ContractPartyComponent
  on property: Contract.term.offer.party
subclass of: Restriction
  all values from: unsignedInt
  on property: Contract.term.offer.securityLabelNumber
subclass of: Restriction
  all values from: CodeableConcept
  max cardinality: 1
  on property: Contract.term.offer.type

NutritionOrder.note
type: ObjectProperty
comment: Comments made about the {{title}} by the requester, performer, subject or other participants.
domain: NutritionOrder
range: Annotation
title: Comments

CoverageEligibilityResponse.outcome
type: ObjectProperty
comment: Transaction status: error, complete.
domain: CoverageEligibilityResponse
range: code
title: queued | complete | error | partial

RequestGroup.action.action.requiredBehavior
type: ObjectProperty
comment: Defines the requiredness behavior for the action.
domain: RequestGroupActionComponentAction
range: code
title: must | could | must-unless-documented

PlanDefinitionActionComponent
type: Class
comment: An action or group of actions to be taken as part of the plan.
subclass of: BackboneElement
subclass of: Restriction
  all values from: string
  max cardinality: 1
  on property: PlanDefinition.action.description
subclass of: Restriction
  all values from: code
  max cardinality: 1
  on property: PlanDefinition.action.cardinalityBehavior
subclass of: Restriction
  all values from: RelatedArtifact
  on property: PlanDefinition.action.documentation
subclass of: Restriction
  all values from: DataRequirement
  on property: PlanDefinition.action.input
subclass of: Restriction
  all values from: string
  max cardinality: 1
  on property: PlanDefinition.action.textEquivalent
subclass of: Restriction
  all values from: id
  on property: PlanDefinition.action.goalId
subclass of: Restriction
  all values from: DataRequirement
  on property: PlanDefinition.action.output
subclass of: Restriction
  all values from: code
  max cardinality: 1
  on property: PlanDefinition.action.priority
subclass of: Restriction
  all values from: TriggerDefinition
  on property: PlanDefinition.action.trigger
subclass of:
  union of: Restriction
    all values from: dateTime
    max cardinality: 1
    on property: PlanDefinition.action.timingDateTime
  union of: Restriction
    all values from: Age
    max cardinality: 1
    on property: PlanDefinition.action.timingAge
  union of: Restriction
    all values from: Period
    max cardinality: 1
    on property: PlanDefinition.action.timingPeriod
  union of: Restriction
    all values from: Duration
    max cardinality: 1
    on property: PlanDefinition.action.timingDuration
  union of: Restriction
    all values from: Range
    max cardinality: 1
    on property: PlanDefinition.action.timingRange
  union of: Restriction
    all values from: Timing
    max cardinality: 1
    on property: PlanDefinition.action.timingTiming
subclass of: Restriction
  all values from: CodeableConcept
  on property: PlanDefinition.action.code
subclass of: Restriction
  all values from: string
  max cardinality: 1
  on property: PlanDefinition.action.prefix
subclass of: Restriction
  all values from: PlanDefinitionActionComponent.PlanDefinitionActionRelatedActionComponent
  on property: PlanDefinition.action.relatedAction
subclass of: Restriction
  all values from: CodeableConcept
  max cardinality: 1
  on property: PlanDefinition.action.type
subclass of: Restriction
  all values from: string
  max cardinality: 1
  on property: PlanDefinition.action.title
subclass of: Restriction
  all values from: PlanDefinitionActionComponent.PlanDefinitionActionDynamicValueComponent
  on property: PlanDefinition.action.dynamicValue
subclass of: Restriction
  all values from: canonical
  max cardinality: 1
  on property: PlanDefinition.action.definition
subclass of: Restriction
  all values from: code
  max cardinality: 1
  on property: PlanDefinition.action.groupingBehavior
subclass of: Restriction
  all values from: PlanDefinitionActionComponentAction
  on property: PlanDefinition.action.action
subclass of: Restriction
  all values from: canonical
  max cardinality: 1
  on property: PlanDefinition.action.transform
subclass of: Restriction
  all values from: CodeableConcept
  on property: PlanDefinition.action.reason
subclass of: Restriction
  all values from: code
  max cardinality: 1
  on property: PlanDefinition.action.selectionBehavior
subclass of: Restriction
  all values from: code
  max cardinality: 1
  on property: PlanDefinition.action.requiredBehavior
subclass of: Restriction
  all values from: PlanDefinitionActionComponent.PlanDefinitionActionParticipantComponent
  on property: PlanDefinition.action.participant
subclass of: Restriction
  all values from: PlanDefinitionActionComponent.PlanDefinitionActionConditionComponent
  on property: PlanDefinition.action.condition
subclass of: Restriction
  all values from: code
  max cardinality: 1
  on property: PlanDefinition.action.precheckBehavior

CareTeam.participant.onBehalfOf
type: ObjectProperty
comment: The organization of the practitioner.
domain: CareTeamParticipantComponent
range: Reference
title: Organization of the practitioner

ChargeItem.priceOverride
type: ObjectProperty
comment: Total price of the charge overriding the list price associated with the code.
domain: ChargeItem
range: Money
title: Price overriding the associated rules

AuditEvent.type
type: ObjectProperty
comment: Identifier for a family of the event. For example, a menu item, program, rule, policy, function code, application name or URL. It identifies the performed function.
domain: AuditEvent
range: Coding
sub property of: what
title: Type/identifier of event

ExplanationOfBenefit.item.detail.subDetail.category
type: ObjectProperty
comment: Health Care Service Type Codes to identify the classification of service or benefits.
domain: ExplanationOfBenefit.ItemComponent.DetailComponent.SubDetailComponent
range: CodeableConcept
title: Type of service or product

OperationDefinition.inputProfile
type: ObjectProperty
comment: Additional validation information for the in parameters - a single profile that covers all the parameters. The profile is a constraint on the parameters resource as a whole.
domain: OperationDefinition
range: canonical
title: Validation information for in parameters

Goal.start
type: ObjectProperty

ExplanationOfBenefit.RelatedClaimComponent
type: Class
comment: Other claims which are related to this claim such as prior claim versions or for related services.
subclass of: BackboneElement
subclass of: Restriction
  all values from: Identifier
  max cardinality: 1
  on property: ExplanationOfBenefit.related.reference
subclass of: Restriction
  all values from: CodeableConcept
  max cardinality: 1
  on property: ExplanationOfBenefit.related.relationship
subclass of: Restriction
  all values from: Reference
  max cardinality: 1
  on property: ExplanationOfBenefit.related.claim

Contract.term.group.asset.answer
type: ObjectProperty
comment: Response to assets.
domain: Contract.TermComponentTerm.ContractAssetComponent
range: Contract.TermComponentTerm.ContractAssetComponentAnswer
title: Response to assets

GraphDefinition.description
type: ObjectProperty
comment: A free text natural language description of the graph definition from a consumer's perspective.
domain: GraphDefinition
range: markdown
title: Natural language description of the graph definition

ImplementationGuide
type: Class
comment: A set of rules of how FHIR is used to solve a particular problem. This resource is used to gather all the parts of an implementation guide into a logical whole and to publish a computable definition of all the parts.
subclass of: conformance.misc
subclass of: DomainResource
subclass of: Restriction
  cardinality: 1
  on property: ImplementationGuide.status
  some values from: code
subclass of: Restriction
  all values from: ImplementationGuideManifestComponent
  max cardinality: 1
  on property: ImplementationGuide.manifest
subclass of: Restriction
  all values from: string
  max cardinality: 1
  on property: ImplementationGuide.title
subclass of: Restriction
  all values from: ImplementationGuideGlobalComponent
  on property: ImplementationGuide.global
subclass of: Restriction
  all values from: string
  max cardinality: 1
  on property: ImplementationGuide.publisher
subclass of: Restriction
  all values from: boolean
  max cardinality: 1
  on property: ImplementationGuide.experimental
subclass of: Restriction
  all values from: ImplementationGuideDependsOnComponent
  on property: ImplementationGuide.dependsOn
subclass of: Restriction
  all values from: UsageContext
  on property: ImplementationGuide.useContext
subclass of: Restriction
  all values from: ContactDetail
  on property: ImplementationGuide.contact
subclass of: Restriction
  all values from: code
  max cardinality: 1
  on property: ImplementationGuide.license
subclass of: Restriction
  cardinality: 1
  on property: ImplementationGuide.url
  some values from: uri
subclass of: Restriction
  all values from: markdown
  max cardinality: 1
  on property: ImplementationGuide.copyright
subclass of: Restriction
  all values from: ImplementationGuideDefinitionComponent
  max cardinality: 1
  on property: ImplementationGuide.definition
subclass of: Restriction
  all values from: id
  max cardinality: 1
  on property: ImplementationGuide.fhirVersion
subclass of: Restriction
  all values from: CodeableConcept
  on property: ImplementationGuide.jurisdiction
subclass of: Restriction
  cardinality: 1
  on property: ImplementationGuide.name
  some values from: string
subclass of: Restriction
  all values from: markdown
  max cardinality: 1
  on property: ImplementationGuide.description
subclass of: Restriction
  all values from: dateTime
  max cardinality: 1
  on property: ImplementationGuide.date
subclass of: Restriction
  all values from: string
  max cardinality: 1
  on property: ImplementationGuide.version
subclass of: Restriction
  all values from: id
  max cardinality: 1
  on property: ImplementationGuide.packageId

Device.udiCarrier.carrierAIDC
type: ObjectProperty
comment: The full UDI carrier of the Automatic Identification and Data Capture (AIDC) technology representation of the barcode string as printed on the packaging of the device - e.g., a barcode or RFID. Because of limitations on character sets in XML and the need to round-trip JSON data through XML, AIDC Formats *SHALL* be base64 encoded.
domain: DeviceUdiCarrierComponent
range: base64Binary
title: UDI Machine Readable Barcode String

Consent.provision.provision.securityLabel
type: ObjectProperty
comment: A security label, comprised of 0..* security label fields (Privacy tags), which define which resources are controlled by this exception.
domain: Consent.provisionComponentProvision
range: Coding
title: Security Labels that define affected resources

Task.ParameterComponent
type: Class
comment: Additional information that may be needed in the execution of the task.
subclass of: BackboneElement
subclass of: Restriction
  cardinality: 1
  on property: Task.input.value
  some values from: Element
subclass of: Restriction
  cardinality: 1
  on property: Task.input.type
  some values from: CodeableConcept

MedicinalProductAuthorization.dateOfFirstAuthorization
type: ObjectProperty
comment: The date when the first authorization was granted by a Medicines Regulatory Agency.
domain: MedicinalProductAuthorization
range: dateTime
title: The date when the first authorization was granted by a Medicines Regulatory Agency

Measure.subject
type: ObjectProperty

Ratio
type: Class
comment: A relationship of two Quantity values - expressed as a numerator and a denominator.
subclass of: Element
subclass of: Restriction
  all values from: Quantity
  max cardinality: 1
  on property: Ratio.denominator
subclass of: Restriction
  all values from: Quantity
  max cardinality: 1
  on property: Ratio.numerator
title: A ratio of two Quantity values - a numerator and a denominator

SupplyRequest.category
type: ObjectProperty
comment: Category of supply, e.g. central, non-stock, etc. This is used to support work flows associated with the supply process.
domain: SupplyRequest
range: CodeableConcept
sub property of: class
title: The kind of supply (central, non-stock, etc.)

Timing.repeat.frequencyMax
type: ObjectProperty
comment: If present, indicates that the frequency is a range - so to repeat between [frequency] and [frequencyMax] times within the period or period range.
domain: TimingRepeatComponent
range: positiveInt
title: Event occurs up to frequencyMax times per period

ExplanationOfBenefit.benefitBalance.financial.usedUnsignedInt
type: ObjectProperty
domain: ExplanationOfBenefit.BenefitBalanceComponent.BenefitComponent
range: unsignedInt
sub property of: ExplanationOfBenefit.benefitBalance.financial.used

MeasureReport.group.population.code
type: ObjectProperty
comment: The type of the population.
domain: MeasureReportGroupComponent.MeasureReportGroupPopulationComponent
range: CodeableConcept
title: initial-population | numerator | numerator-exclusion | denominator | denominator-exclusion | denominator-exception | measure-population | measure-population-exclusion | measure-observation

Provenance.entity.agent.who
type: ObjectProperty
comment: The individual, device or organization that participated in the event.
domain: ProvenanceEntityComponentAgent
range: Reference
sub property of: who.actor
title: Who participated

Measure.group.stratifier
type: ObjectProperty
comment: The stratifier criteria for the measure report, specified as either the name of a valid CQL expression defined within a referenced library or a valid FHIR Resource Path.
domain: MeasureGroupComponent
range: MeasureGroupComponent.MeasureGroupStratifierComponent
title: Stratifier criteria for the measure

VerificationResult.attestation.signedSourceAttestation
type: ObjectProperty

ClaimResponse.use
type: ObjectProperty
comment: A claim, a list of completed goods and services; a preauthorization, a list or proposed goods and services; or a predetermination, a set of goods and services being considered, for which insurer adjudication is sought.
domain: ClaimResponse
range: code
sub property of: class
title: claim | preauthorization | predetermination

ElementDefinition.mapping.comment
type: ObjectProperty
comment: Comments that provide information about the mapping or its use.
domain: ElementDefinitionMappingComponent
range: string
title: Comments about the mapping or its use

GuidanceResponse.subject
type: ObjectProperty
comment: The patient for which the request was processed.
domain: GuidanceResponse
range: Reference
sub property of: who.focus
title: Patient the request was performed for

FamilyMemberHistory.condition.onset
type: ObjectProperty

AuditEventEntityComponent
type: Class
comment: Specific instances of data or objects that have been accessed.
subclass of: BackboneElement
subclass of: Restriction
  all values from: Reference
  max cardinality: 1
  on property: AuditEvent.entity.what
subclass of: Restriction
  all values from: string
  max cardinality: 1
  on property: AuditEvent.entity.description
subclass of: Restriction
  all values from: Coding
  max cardinality: 1
  on property: AuditEvent.entity.role
subclass of: Restriction
  all values from: Coding
  max cardinality: 1
  on property: AuditEvent.entity.type
subclass of: Restriction
  all values from: base64Binary
  max cardinality: 1
  on property: AuditEvent.entity.query
subclass of: Restriction
  all values from: AuditEventEntityComponent.AuditEventEntityDetailComponent
  on property: AuditEvent.entity.detail
subclass of: Restriction
  all values from: Coding
  max cardinality: 1
  on property: AuditEvent.entity.lifecycle
subclass of: Restriction
  all values from: string
  max cardinality: 1
  on property: AuditEvent.entity.name
subclass of: Restriction
  all values from: Coding
  on property: AuditEvent.entity.securityLabel

Contract.TermComponent.ContractAssetComponentAnswer
type: Class
comment: Response to assets.
subclass of: BackboneElement
subclass of:
  union of: Restriction
    cardinality: 1
    on property: Contract.term.asset.answer.valueBoolean
    some values from: boolean
  union of: Restriction
    cardinality: 1
    on property: Contract.term.asset.answer.valueDecimal
    some values from: decimal
  union of: Restriction
    cardinality: 1
    on property: Contract.term.asset.answer.valueInteger
    some values from: integer
  union of: Restriction
    cardinality: 1
    on property: Contract.term.asset.answer.valueDate
    some values from: date
  union of: Restriction
    cardinality: 1
    on property: Contract.term.asset.answer.valueDateTime
    some values from: dateTime
  union of: Restriction
    cardinality: 1
    on property: Contract.term.asset.answer.valueTime
    some values from: time
  union of: Restriction
    cardinality: 1
    on property: Contract.term.asset.answer.valueString
    some values from: string
  union of: Restriction
    cardinality: 1
    on property: Contract.term.asset.answer.valueUri
    some values from: uri
  union of: Restriction
    cardinality: 1
    on property: Contract.term.asset.answer.valueAttachment
    some values from: Attachment
  union of: Restriction
    cardinality: 1
    on property: Contract.term.asset.answer.valueCoding
    some values from: Coding
  union of: Restriction
    cardinality: 1
    on property: Contract.term.asset.answer.valueQuantity
    some values from: Quantity
  union of: Restriction
    cardinality: 1
    on property: Contract.term.asset.answer.valueReference
    some values from: Reference
title: Response to assets

VerificationResult.validator.signedValidatorAttestationUri
type: ObjectProperty
domain: VerificationResultValidatorComponent
range: uri
sub property of: VerificationResult.validator.signedValidatorAttestation

QuestionnaireResponse.item.answer.valueBoolean
type: ObjectProperty
domain: QuestionnaireResponseItemComponent.QuestionnaireResponseItemAnswerComponent
range: boolean
sub property of: QuestionnaireResponse.item.answer.value

TestScript.setup.action.assert.path
type: ObjectProperty
comment: The XPath or JSONPath expression to be evaluated against the fixture representing the response received from server.
domain: TestScriptSetupComponent.SetupActionComponent.SetupActionAssertComponent
range: string
title: XPath or JSONPath expression

SubstanceAmount.amountText
type: ObjectProperty
comment: A textual comment on a numeric value.
domain: SubstanceAmount
range: string
title: A textual comment on a numeric value

DeviceUseStatement.source
type: ObjectProperty
comment: Who reported the device was being used by the patient.
domain: DeviceUseStatement
range: Reference
sub property of: who.actor
title: Who made the statement

RequestGroup.action.action.condition.description
type: ObjectProperty
comment: A brief, natural language description of the condition that effectively communicates the intended semantics.
domain: RequestGroupActionComponentAction.RequestGroupActionConditionComponent
range: string
title: Natural language description of the condition

BundleEntryComponent.BundleEntryResponseComponent
type: Class
comment: Indicates the results of processing the corresponding 'request' entry in the batch or transaction being responded to or what the results of an operation where when returning history.
subclass of: BackboneElement
subclass of: Restriction
  all values from: Resource
  max cardinality: 1
  on property: Bundle.entry.response.outcome
subclass of: Restriction
  all values from: instant
  max cardinality: 1
  on property: Bundle.entry.response.lastModified
subclass of: Restriction
  all values from: string
  max cardinality: 1
  on property: Bundle.entry.response.etag
subclass of: Restriction
  all values from: uri
  max cardinality: 1
  on property: Bundle.entry.response.location
subclass of: Restriction
  cardinality: 1
  on property: Bundle.entry.response.status
  some values from: string

DataRequirement.dateFilter.searchParam
type: ObjectProperty
comment: A date parameter that refers to a search parameter defined on the specified type of the DataRequirement, and which searches on elements of type date, dateTime, Period, Schedule, or Timing.
domain: DataRequirementDateFilterComponent
range: string
title: A date valued parameter to search on

StructureMap.group
type: ObjectProperty
comment: Organizes the mapping into manageable chunks for human review/ease of maintenance.
domain: StructureMap
range: StructureMapGroupComponent
title: Named sections for reader convenience

ImplementationGuide.title
type: ObjectProperty
comment: A short, descriptive, user-friendly title for the implementation guide.
domain: ImplementationGuide
range: string
title: Name for this implementation guide (human friendly)

CompartmentDefinition
type: Class
comment: A compartment definition that defines how resources are accessed on a server.
subclass of: DomainResource
subclass of: conformance.behavior
subclass of: Restriction
  all values from: markdown
  max cardinality: 1
  on property: CompartmentDefinition.purpose
subclass of: Restriction
  all values from: string
  max cardinality: 1
  on property: CompartmentDefinition.version
subclass of: Restriction
  all values from: markdown
  max cardinality: 1
  on property: CompartmentDefinition.description
subclass of: Restriction
  cardinality: 1
  on property: CompartmentDefinition.search
  some values from: boolean
subclass of: Restriction
  all values from: dateTime
  max cardinality: 1
  on property: CompartmentDefinition.date
subclass of: Restriction
  cardinality: 1
  on property: CompartmentDefinition.status
  some values from: code
subclass of: Restriction
  all values from: ContactDetail
  on property: CompartmentDefinition.contact
subclass of: Restriction
  cardinality: 1
  on property: CompartmentDefinition.code
  some values from: code
subclass of: Restriction
  cardinality: 1
  on property: CompartmentDefinition.name
  some values from: string
subclass of: Restriction
  all values from: UsageContext
  on property: CompartmentDefinition.useContext
subclass of: Restriction
  cardinality: 1
  on property: CompartmentDefinition.url
  some values from: uri
subclass of: Restriction
  all values from: boolean
  max cardinality: 1
  on property: CompartmentDefinition.experimental
subclass of: Restriction
  all values from: string
  max cardinality: 1
  on property: CompartmentDefinition.publisher
subclass of: Restriction
  all values from: CompartmentDefinitionResourceComponent
  on property: CompartmentDefinition.resource

TestScript.setup.action.assert
type: ObjectProperty
comment: Evaluates the results of previous operations to determine if the server under test behaves appropriately.
domain: TestScriptSetupComponent.SetupActionComponent
range: TestScriptSetupComponent.SetupActionComponent.SetupActionAssertComponent
title: The assertion to perform

Patient.birthDate
type: ObjectProperty
comment: The date of birth for the individual.
domain: Patient
range: date
title: The date of birth for the individual

VerificationResult.target
type: ObjectProperty
comment: A resource that was validated.
domain: VerificationResult
range: Reference
title: A resource that was validated

MedicationStatement.medicationReference
type: ObjectProperty
domain: MedicationStatement
range: Reference
sub property of: MedicationStatement.medication

ImplementationGuide.definition.template.code
type: ObjectProperty
comment: Type of template specified.
domain: ImplementationGuideDefinitionComponent.ImplementationGuideDefinitionTemplateComponent
range: code
title: Type of template specified

ExplanationOfBenefit.accident.location
type: ObjectProperty

ExampleScenario.process.step.process.step.alternative.option.step
type: ObjectProperty
comment: What happens in each alternative option.
domain: ExampleScenarioProcessComponent.ExampleScenarioProcessStepComponentProcess.ExampleScenarioProcessStepComponent.ExampleScenarioProcessStepAlternativeComponent.ExampleScenarioProcessStepAlternativeOptionComponent
range: ExampleScenarioProcessComponent.ExampleScenarioProcessStepComponentProcess.ExampleScenarioProcessStepComponent.ExampleScenarioProcessStepAlternativeComponent.ExampleScenarioProcessStepAlternativeOptionComponentStep
title: What happens in each alternative option

ValueSet.compose.exclude.concept.designation
type: ObjectProperty
comment: Additional representations for this concept when used in this value set - other languages, aliases, specialized purposes, used for particular purposes, etc.
domain: ValueSetComposeComponentInclude.ConceptReferenceComponent
range: ValueSetComposeComponentInclude.ConceptReferenceComponent.ConceptReferenceDesignationComponent
title: Additional representations for this concept

Questionnaire.item.repeats
type: ObjectProperty
comment: An indication, if true, that the item may occur multiple times in the response, collecting multiple answers for questions or multiple sets of answers for groups.
domain: QuestionnaireItemComponent
range: boolean
title: Whether the item may repeat

ExplanationOfBenefit.careTeam.role
type: ObjectProperty
comment: The lead, assisting or supervising practitioner and their discipline if a multidisiplinary team.
domain: ExplanationOfBenefit.CareTeamComponent
range: CodeableConcept
title: Role on the team

StructureDefinition.fhirVersion
type: ObjectProperty
comment: The version of the FHIR specification on which this StructureDefinition is based - this is the formal version of the specification, without the revision number, e.g. [publication].[major].[minor], which is 3.5a.0. for this version.
domain: StructureDefinition
range: id
title: FHIR Version this StructureDefinition targets

ObservationDefinition.permittedDataType
type: ObjectProperty
comment: Data type allowed for the result of the observation.
domain: ObservationDefinition
range: Coding
title: Permitted data type for observation value

AllergyIntolerance.criticality
type: ObjectProperty
comment: Estimate of the potential clinical harm, or seriousness, of the reaction to the identified substance.
domain: AllergyIntolerance
range: code
sub property of: grade
title: low | high | unable-to-assess

CompositionEventComponent
type: Class
comment: The clinical service, such as a colonoscopy or an appendectomy, being documented.
subclass of: BackboneElement
subclass of: Restriction
  all values from: Reference
  on property: Composition.event.detail
subclass of: Restriction
  all values from: Period
  max cardinality: 1
  on property: Composition.event.period
subclass of: Restriction
  all values from: CodeableConcept
  on property: Composition.event.code

CoverageEligibilityRequest.insurance.focal
type: ObjectProperty
comment: A flag to indicate that this Coverage is the focus for adjudication. The Coverage against which the claim is to be adjudicated.
domain: CoverageEligibilityRequest.InsuranceComponent
range: boolean
title: Is the focal Coverage

MedicinalProduct.packagedMedicinalProduct
type: ObjectProperty
comment: Package representation for the product.
domain: MedicinalProduct
range: Reference
title: Package representation for the product

ElementDefinition.type.targetProfile
type: ObjectProperty
comment: Used when the type is "Reference" or "canonical", and identifies a profile structure or implementation Guide that applies to the target of the reference this element refers to. If any profiles are specified, then the content must conform to at least one of them. The URL can be a local reference - to a contained StructureDefinition, or a reference to another StructureDefinition or Implementation Guide by a canonical URL. When an implementation guide is specified, the target resource SHALL conform to at least one profile defined in the implementation guide.
domain: ElementDefinition.TypeRefComponent
range: canonical
title: Profile (StructureDefinition or IG) on the Reference/canonical target - one must apply

Subscription.reason
type: ObjectProperty
comment: A description of why this subscription is defined.
domain: Subscription
range: string
sub property of: why
title: Description of why this subscription was created

MedicationDispense.subject
type: ObjectProperty
comment: A link to a resource representing the person or the group to whom the medication will be given.
domain: MedicationDispense
range: Reference
sub property of: who.focus
title: Who the dispense is for

Specimen
type: Class
comment: A sample to be used for analysis.
subclass of: DomainResource
subclass of: clinical.diagnostics
subclass of: Restriction
  all values from: Identifier
  max cardinality: 1
  on property: Specimen.accessionIdentifier
subclass of: Restriction
  all values from: SpecimenCollectionComponent
  max cardinality: 1
  on property: Specimen.collection
subclass of: Restriction
  all values from: dateTime
  max cardinality: 1
  on property: Specimen.receivedTime
subclass of: Restriction
  all values from: code
  max cardinality: 1
  on property: Specimen.status
subclass of: Restriction
  all values from: Reference
  on property: Specimen.parent
subclass of: Restriction
  all values from: SpecimenProcessingComponent
  on property: Specimen.processing
subclass of: Restriction
  all values from: CodeableConcept
  on property: Specimen.condition
subclass of: Restriction
  all values from: Identifier
  on property: Specimen.identifier
subclass of: Restriction
  all values from: Annotation
  on property: Specimen.note
subclass of: Restriction
  all values from: Reference
  max cardinality: 1
  on property: Specimen.subject
subclass of: Restriction
  all values from: SpecimenContainerComponent
  on property: Specimen.container
subclass of: Restriction
  all values from: Reference
  on property: Specimen.request
subclass of: Restriction
  all values from: CodeableConcept
  max cardinality: 1
  on property: Specimen.type

ExampleScenario.purpose
type: ObjectProperty
comment: What the example scenario resource is created for. This should not be used to show the business purpose of the scenario itself, but the purpose of documenting a scenario.
domain: ExampleScenario
range: markdown
sub property of: why
title: The purpose of the example, e.g. to illustrate a scenario

DeviceDefinition.udiDeviceIdentifier
type: ObjectProperty
comment: Unique device identifier (UDI) assigned to device label or package. Note that the Device may include multiple udiCarriers as it either may include just the udiCarrier for the jurisdiction it is sold, or for multiple jurisdictions it could have been sold.
domain: DeviceDefinition
range: DeviceDefinitionUdiDeviceIdentifierComponent
title: Unique Device Identifier (UDI) Barcode string

DetectedIssue.mitigation.date
type: ObjectProperty
comment: Indicates when the mitigating action was documented.
domain: DetectedIssueMitigationComponent
range: dateTime
title: Date committed

ImmunizationRecommendation.recommendation.doseNumber
type: ObjectProperty

OperationDefinition
type: Class
comment: A formal computable definition of an operation (on the RESTful interface) or a named query (using the search interaction).
subclass of: conformance.behavior
subclass of: DomainResource
subclass of: Restriction
  all values from: string
  max cardinality: 1
  on property: OperationDefinition.title
subclass of: Restriction
  all values from: string
  max cardinality: 1
  on property: OperationDefinition.version
subclass of: Restriction
  all values from: canonical
  max cardinality: 1
  on property: OperationDefinition.base
subclass of: Restriction
  cardinality: 1
  on property: OperationDefinition.status
  some values from: code
subclass of: Restriction
  all values from: CodeableConcept
  on property: OperationDefinition.jurisdiction
subclass of: Restriction
  cardinality: 1
  on property: OperationDefinition.instance
  some values from: boolean
subclass of: Restriction
  all values from: canonical
  max cardinality: 1
  on property: OperationDefinition.inputProfile
subclass of: Restriction
  cardinality: 1
  on property: OperationDefinition.name
  some values from: string
subclass of: Restriction
  all values from: uri
  max cardinality: 1
  on property: OperationDefinition.url
subclass of: Restriction
  cardinality: 1
  on property: OperationDefinition.system
  some values from: boolean
subclass of: Restriction
  all values from: markdown
  max cardinality: 1
  on property: OperationDefinition.description
subclass of: Restriction
  all values from: dateTime
  max cardinality: 1
  on property: OperationDefinition.date
subclass of: Restriction
  cardinality: 1
  on property: OperationDefinition.code
  some values from: code
subclass of: Restriction
  cardinality: 1
  on property: OperationDefinition.type
  some values from: boolean
subclass of: Restriction
  all values from: UsageContext
  on property: OperationDefinition.useContext
subclass of: Restriction
  all values from: string
  max cardinality: 1
  on property: OperationDefinition.publisher
subclass of: Restriction
  all values from: markdown
  max cardinality: 1
  on property: OperationDefinition.comment
subclass of: Restriction
  all values from: OperationDefinitionParameterComponent
  on property: OperationDefinition.parameter
subclass of: Restriction
  cardinality: 1
  on property: OperationDefinition.kind
  some values from: code
subclass of: Restriction
  all values from: markdown
  max cardinality: 1
  on property: OperationDefinition.purpose
subclass of: Restriction
  all values from: boolean
  max cardinality: 1
  on property: OperationDefinition.experimental
subclass of: Restriction
  all values from: boolean
  max cardinality: 1
  on property: OperationDefinition.affectsState
subclass of: Restriction
  all values from: canonical
  max cardinality: 1
  on property: OperationDefinition.outputProfile
subclass of: Restriction
  all values from: ContactDetail
  on property: OperationDefinition.contact
subclass of: Restriction
  all values from: code
  on property: OperationDefinition.resource
subclass of: Restriction
  all values from: OperationDefinitionOverloadComponent
  on property: OperationDefinition.overload

MedicinalProduct.name.namePart
type: ObjectProperty
comment: Coding words or phrases of the name.
domain: MedicinalProductNameComponent
range: MedicinalProductNameComponent.MedicinalProductNameNamePartComponent
title: Coding words or phrases of the name

ObservationDefinition.method
type: ObjectProperty
comment: The method or technique used to perform the observation.
domain: ObservationDefinition
range: CodeableConcept
title: The method or technique used to perform the observation

QuestionnaireResponse.item.answer.item.answer.valueAttachment
type: ObjectProperty
domain: QuestionnaireResponseItemComponent.QuestionnaireResponseItemAnswerComponentItem.QuestionnaireResponseItemAnswerComponent
range: Attachment
sub property of: QuestionnaireResponse.item.answer.item.answer.value

Location.status
type: ObjectProperty
comment: The status property covers the general availability of the resource, not the current value which may be covered by the operationStatus, or by a schedule/slots if they are configured for the location.
domain: Location
range: code
sub property of: status
title: active | suspended | inactive

Observation.comment
type: ObjectProperty
comment: Comments about the test result value may include statements about significant, unexpected or unreliable results values, or information about the its source when this is relevant to its interpretation.
domain: Observation
range: string
title: Comments about the test result value

ExplanationOfBenefit.ItemComponent.DetailComponent
type: Class
comment: Second-tier of goods and services.
subclass of: BackboneElement
subclass of: Restriction
  all values from: Reference
  on property: ExplanationOfBenefit.item.detail.udi
subclass of: Restriction
  all values from: Money
  max cardinality: 1
  on property: ExplanationOfBenefit.item.detail.net
subclass of: Restriction
  all values from: CodeableConcept
  max cardinality: 1
  on property: ExplanationOfBenefit.item.detail.revenue
subclass of: Restriction
  all values from: positiveInt
  on property: ExplanationOfBenefit.item.detail.noteNumber
subclass of: Restriction
  cardinality: 1
  on property: ExplanationOfBenefit.item.detail.sequence
  some values from: positiveInt
subclass of: Restriction
  all values from: CodeableConcept
  max cardinality: 1
  on property: ExplanationOfBenefit.item.detail.billcode
subclass of: Restriction
  all values from: SimpleQuantity
  max cardinality: 1
  on property: ExplanationOfBenefit.item.detail.quantity
subclass of: Restriction
  all values from: CodeableConcept
  max cardinality: 1
  on property: ExplanationOfBenefit.item.detail.category
subclass of: Restriction
  all values from: CodeableConcept
  on property: ExplanationOfBenefit.item.detail.programCode
subclass of: Restriction
  all values from: ExplanationOfBenefit.ItemComponent.DetailComponent.SubDetailComponent
  on property: ExplanationOfBenefit.item.detail.subDetail
subclass of: Restriction
  all values from: decimal
  max cardinality: 1
  on property: ExplanationOfBenefit.item.detail.factor
subclass of: Restriction
  all values from: CodeableConcept
  on property: ExplanationOfBenefit.item.detail.modifier
subclass of: Restriction
  all values from: ExplanationOfBenefit.ItemComponent.DetailComponentAdjudication
  on property: ExplanationOfBenefit.item.detail.adjudication
subclass of: Restriction
  all values from: Money
  max cardinality: 1
  on property: ExplanationOfBenefit.item.detail.unitPrice

Task.basedOn
type: ObjectProperty
comment: BasedOn refers to a higher-level authorization that triggered the creation of the task. It references a "request" resource such as a ServiceRequest, MedicationRequest, ServiceRequest, CarePlan, etc. which is distinct from the "request" resource the task is seeking to fulfill. This latter resource is referenced by FocusOn. For example, based on a ServiceRequest (= BasedOn), a task is created to fulfill a procedureRequest ( = FocusOn ) to collect a specimen from a patient.
domain: Task
range: Reference
title: Request fulfilled by this task

Library.topic
type: ObjectProperty
comment: Descriptive topics related to the content of the library. Topics provide a high-level categorization of the library that can be useful for filtering and searching.
domain: Library
range: CodeableConcept
title: E.g. Education, Treatment, Assessment, etc.

Provenance.agent.who
type: ObjectProperty
comment: The individual, device or organization that participated in the event.
domain: ProvenanceAgentComponent
range: Reference
sub property of: who.actor
title: Who participated

CoverageEligibilityResponse.status
type: ObjectProperty
comment: The status of the resource instance.
domain: CoverageEligibilityResponse
range: code
sub property of: status
title: active | cancelled | draft | entered-in-error

DeviceMetric.color
type: ObjectProperty
comment: Describes the color representation for the metric. This is often used to aid clinicians to track and identify parameter types by color. In practice, consider a Patient Monitor that has ECG/HR and Pleth for example; the parameters are displayed in different characteristic colors, such as HR-blue, BP-green, and PR and SpO2- magenta.
domain: DeviceMetric
range: code
title: black | red | green | yellow | blue | magenta | cyan | white

ActivityDefinition.jurisdiction
type: ObjectProperty
comment: A legal or geographic region in which the activity definition is intended to be used.
domain: ActivityDefinition
range: CodeableConcept
title: Intended jurisdiction for activity definition (if applicable)

Contract.term.group.asset.context.reference
type: ObjectProperty
comment: Asset context reference may include the creator, custodian, or owning Person or Organization (e.g., bank, repository), location held, e.g., building, jurisdiction.
domain: Contract.TermComponentTerm.ContractAssetComponent.AssetContextComponent
range: Reference
title: Creator,custodian or owner

Sequence.quality.recall
type: ObjectProperty
comment: TRUTH.TP / (TRUTH.TP + TRUTH.FN).
domain: SequenceQualityComponent
range: decimal
title: Recall of comparison

ServiceRequest.asNeededCodeableConcept
type: ObjectProperty
domain: ServiceRequest
range: CodeableConcept
sub property of: ServiceRequest.asNeeded

Practitioner.photo
type: ObjectProperty
comment: Image of the person.
domain: Practitioner
range: Attachment
title: Image of the person

CapabilityStatement.rest.resource.readHistory
type: ObjectProperty
comment: A flag for whether the server is able to return past versions as part of the vRead operation.
domain: CapabilityStatementRestComponent.CapabilityStatementRestResourceComponent
range: boolean
title: Whether vRead can return past versions

ExplanationOfBenefit.information.code
type: ObjectProperty
comment: System and code pertaining to the specific information regarding special conditions relating to the setting, treatment or patient for which care is sought which may influence the adjudication.
domain: ExplanationOfBenefit.SupportingInformationComponent
range: CodeableConcept
title: Type of information

Observation.identifier
type: ObjectProperty
comment: A unique identifier assigned to this observation.
domain: Observation
range: Identifier
sub property of: id
title: Business Identifier for observation

MessageDefinition.url
type: ObjectProperty
comment: The business identifier that is used to reference the MessageDefinition and *is* expected to be consistent from server to server.
domain: MessageDefinition
range: uri
sub property of: id
title: Business Identifier for a given MessageDefinition

CodeSystem.concept.concept.property.valueDecimal
type: ObjectProperty
domain: CodeSystem.ConceptDefinitionComponentConcept.ConceptPropertyComponent
range: decimal
sub property of: CodeSystem.concept.concept.property.value

ClaimResponse.item.detail.adjudication
type: ObjectProperty
comment: The adjudication results.
domain: ClaimResponse.ItemComponent.ItemDetailComponent
range: ClaimResponse.ItemComponent.ItemDetailComponentAdjudication
title: Detail level adjudication details

Contract.legal.contentReference
type: ObjectProperty
domain: Contract.LegalLanguageComponent
range: Reference
sub property of: Contract.legal.content

Questionnaire.title
type: ObjectProperty
comment: A short, descriptive, user-friendly title for the questionnaire.
domain: Questionnaire
range: string
title: Name for this questionnaire (human friendly)

CoverageEligibilityResponse.InsuranceComponent
type: Class
comment: The insurer may provide both the details for the requested coverage as well as details for additional coverages known to the insurer.
subclass of: BackboneElement
subclass of: Restriction
  all values from: CoverageEligibilityResponse.InsuranceComponent.ItemsComponent
  on property: CoverageEligibilityResponse.insurance.item
subclass of: Restriction
  all values from: boolean
  max cardinality: 1
  on property: CoverageEligibilityResponse.insurance.inforce
subclass of: Restriction
  all values from: Reference
  max cardinality: 1
  on property: CoverageEligibilityResponse.insurance.contract
subclass of: Restriction
  all values from: Reference
  max cardinality: 1
  on property: CoverageEligibilityResponse.insurance.coverage

Dosage.asNeededBoolean
type: ObjectProperty
domain: Dosage
range: boolean
sub property of: Dosage.asNeeded

DetectedIssue.category
type: ObjectProperty
comment: Identifies the general type of issue identified.
domain: DetectedIssue
range: CodeableConcept
sub property of: class
title: Issue Category, e.g. drug-drug, duplicate therapy, etc.

ElementDefinition.constraint
type: ObjectProperty
comment: Formal constraints such as co-occurrence and other constraints that can be computationally evaluated within the context of the instance.
domain: ElementDefinition
range: ElementDefinitionConstraintComponent
title: Condition that must evaluate to true

Questionnaire.publisher
type: ObjectProperty
comment: The name of the organization or individual that published the questionnaire.
domain: Questionnaire
range: string
sub property of: who.witness
title: Name of the publisher (organization or individual)

CoverageEligibilityResponse.insurance.item.benefit.allowed
type: ObjectProperty

ExplanationOfBenefit.payment.amount
type: ObjectProperty
comment: Payable less any payment adjustment.
domain: ExplanationOfBenefit.PaymentComponent
range: Money
title: Payable amount after adjustment

TestScript.teardown.action.operation.requestId
type: ObjectProperty
comment: The fixture id (maybe new) to map to the request.
domain: TestScriptTeardownComponent.TeardownActionComponentOperation
range: id
title: Fixture Id of mapped request

nodeRole
type: ObjectProperty
domain: Resource
range: treeRoot
title: Identifies role of subject in context of a given document

ExplanationOfBenefit.originalPrescription
type: ObjectProperty
comment: Original prescription which has been superceded by this prescription to support the dispensing of pharmacy services, medications or products. For example, a physician may prescribe a medication which the pharmacy determines is contraindicated, or for which the patient has an intolerance, and therefor issues a new precription for an alternate medication which has the same theraputic intent. The prescription from the pharmacy becomes the 'prescription' and that from the physician becomes the 'original prescription'.
domain: ExplanationOfBenefit
range: Reference
title: Original prescription if superceded by fulfiller

SubstanceSpecification.structure.molecularWeight.method
type: ObjectProperty
comment: The method by which the molecular weight was determined.
domain: SubstanceSpecificationStructureComponentMolecularWeight
range: CodeableConcept
title: The method by which the molecular weight was determined

MedicinalProductPharmaceutical.characteristics
type: ObjectProperty
comment: Characteristics e.g. a products onset of action.
domain: MedicinalProductPharmaceutical
range: MedicinalProductPharmaceuticalCharacteristicsComponent
title: Characteristics e.g. a products onset of action

Encounter.participant.individual
type: ObjectProperty
comment: Persons involved in the encounter other than the patient.
domain: EncounterParticipantComponent
range: Reference
sub property of: who
title: Persons involved in the encounter other than the patient

TestReport.teardown.action.operation
type: ObjectProperty
comment: An operation would involve a REST request to a server.
domain: TestReportTeardownComponent.TeardownActionComponent
range: TestReportTeardownComponent.TeardownActionComponentOperation
title: The teardown operation performed

MedicinalProductIngredient.specifiedSubstance.strength.concentrationLowLimit
type: ObjectProperty
comment: A lower limit for the strength per unitary volume (or mass), for when there is a range. The concentration attribute then becomes the upper limit.
domain: MedicinalProductIngredientSpecifiedSubstanceComponent.MedicinalProductIngredientSpecifiedSubstanceStrengthComponent
range: Ratio
title: A lower limit for the strength per unitary volume (or mass), for when there is a range. The concentration attribute then becomes the upper limit

EnrollmentRequest.status
type: ObjectProperty
comment: The status of the resource instance.
domain: EnrollmentRequest
range: code
title: active | cancelled | draft | entered-in-error

PaymentReconciliation.detail.date
type: ObjectProperty
comment: The date of the invoice or financial resource.
domain: PaymentReconciliation.DetailsComponent
range: date
title: Invoice date

Sequence.referenceSeq
type: ObjectProperty
comment: A sequence that is used as a reference to describe variants that are present in a sequence analyzed.
domain: Sequence
range: SequenceReferenceSeqComponent
title: A sequence used as reference

Contract.term.group.asset.answer.valueAttachment
type: ObjectProperty
domain: Contract.TermComponentTerm.ContractAssetComponentAnswer
range: Attachment
sub property of: Contract.term.group.asset.answer.value

MedicinalProductNameComponent.MedicinalProductNameCountryLanguageComponent
type: Class
comment: Country where the name applies.
subclass of: BackboneElement
subclass of: Restriction
  cardinality: 1
  on property: MedicinalProduct.name.countryLanguage.language
  some values from: CodeableConcept
subclass of: Restriction
  all values from: CodeableConcept
  max cardinality: 1
  on property: MedicinalProduct.name.countryLanguage.jurisdiction
subclass of: Restriction
  cardinality: 1
  on property: MedicinalProduct.name.countryLanguage.country
  some values from: CodeableConcept

ImagingStudy.started
type: ObjectProperty
comment: Date and time the study started.
domain: ImagingStudy
range: dateTime
sub property of: when.init
title: When the study was started

Contract.name
type: ObjectProperty
comment: A natural language name identifying this Contract definition, derivative, or instance in any legal state. Provides additional information about its content. This name should be usable as an identifier for the module by machine processing applications such as code generation.
domain: Contract
range: string
title: Computer friendly designation

MessageHeader.destination.endpoint
type: ObjectProperty
comment: Indicates where the message should be routed to.
domain: MessageHeader.MessageDestinationComponent
range: url
title: Actual destination address or id

MedicationAdministration.supportingInformation
type: ObjectProperty
comment: Additional information (for example, patient height and weight) that supports the administration of the medication.
domain: MedicationAdministration
range: Reference
sub property of: context
title: Additional information to support administration

DeviceDefinition.deviceName
type: ObjectProperty
comment: A name given to the device to identify it.
domain: DeviceDefinition
range: DeviceDefinitionDeviceNameComponent
title: A name given to the device to identify it

PlanDefinition.action.code
type: ObjectProperty
comment: A code that provides meaning for the action or action group. For example, a section may have a LOINC code for the section of a documentation template.
domain: PlanDefinitionActionComponent
range: CodeableConcept
title: Code representing the meaning of the action or sub-actions

ServiceRequest.asNeededBoolean
type: ObjectProperty
domain: ServiceRequest
range: boolean
sub property of: ServiceRequest.asNeeded

DataRequirement.subject
type: ObjectProperty

Questionnaire.item.item.answerOption.valueDate
type: ObjectProperty
domain: QuestionnaireItemComponentItem.QuestionnaireItemAnswerOptionComponent
range: date
sub property of: Questionnaire.item.item.answerOption.value

MedicinalProductPackaged.packageItem.shelfLifeStorage
type: ObjectProperty
comment: Shelf Life and storage information.
domain: MedicinalProductPackagedPackageItemComponent
range: ProductShelfLife
title: Shelf Life and storage information

ExplanationOfBenefit.item.adjudication.value
type: ObjectProperty
comment: A non-monetary value for example a percentage. Mutually exclusive to the amount element above.
domain: ExplanationOfBenefit.ItemComponent.AdjudicationComponent
range: decimal
title: Non-monitory value

MedicationKnowledge.medicineClassification
type: ObjectProperty
comment: Categorization of the medication within a formulary or classification system.
domain: MedicationKnowledge
range: MedicationKnowledgeMedicineClassificationComponent
title: Categorization of the medication within a formulary or classification system

Address
type: Class
comment: An address expressed using postal conventions (as opposed to GPS or other location definition formats). This data type may be used to convey addresses for use in delivering mail as well as for visiting locations which might not be valid for mail delivery. There are a variety of postal address formats defined around the world.
subclass of: Element
subclass of: Restriction
  all values from: Period
  max cardinality: 1
  on property: Address.period
subclass of: Restriction
  all values from: code
  max cardinality: 1
  on property: Address.use
subclass of: Restriction
  all values from: code
  max cardinality: 1
  on property: Address.type
subclass of: Restriction
  all values from: string
  max cardinality: 1
  on property: Address.city
subclass of: Restriction
  all values from: string
  max cardinality: 1
  on property: Address.district
subclass of: Restriction
  all values from: string
  max cardinality: 1
  on property: Address.country
subclass of: Restriction
  all values from: string
  max cardinality: 1
  on property: Address.postalCode
subclass of: Restriction
  all values from: string
  max cardinality: 1
  on property: Address.state
subclass of: Restriction
  all values from: string
  max cardinality: 1
  on property: Address.text
subclass of: Restriction
  all values from: string
  on property: Address.line
title: An address expressed using postal conventions (as opposed to GPS or other location definition formats)

MedicinalProductClinicals.contraindication.therapeuticIndication.population.ageCodeableConcept
type: ObjectProperty
domain: MedicinalProductClinicalsContraindicationComponentTherapeuticIndicationPopulation
range: CodeableConcept
sub property of: MedicinalProductClinicals.contraindication.therapeuticIndication.population.age

Specimen.collection.bodySite
type: ObjectProperty
comment: Anatomical location from which the specimen was collected (if subject is a patient). This is the target site. This element is not used for environmental specimens.
domain: SpecimenCollectionComponent
range: CodeableConcept
title: Anatomical collection site

InsurancePlanCoverageComponent.CoverageBenefitComponent.CoverageBenefitLimitComponent
type: Class
comment: The specific limits on the benefit.
subclass of: BackboneElement
subclass of: Restriction
  all values from: CodeableConcept
  max cardinality: 1
  on property: InsurancePlan.coverage.benefit.limit.code
subclass of: Restriction
  all values from: Quantity
  max cardinality: 1
  on property: InsurancePlan.coverage.benefit.limit.value

TestReport
type: Class
comment: A summary of information based on the results of executing a TestScript.
subclass of: conformance.misc
subclass of: DomainResource
subclass of: Restriction
  all values from: string
  max cardinality: 1
  on property: TestReport.name
subclass of: Restriction
  cardinality: 1
  on property: TestReport.result
  some values from: code
subclass of: Restriction
  cardinality: 1
  on property: TestReport.testScript
  some values from: Reference
subclass of: Restriction
  all values from: TestReportTestComponent
  on property: TestReport.test
subclass of: Restriction
  all values from: string
  max cardinality: 1
  on property: TestReport.tester
subclass of: Restriction
  all values from: decimal
  max cardinality: 1
  on property: TestReport.score
subclass of: Restriction
  all values from: TestReportTeardownComponent
  max cardinality: 1
  on property: TestReport.teardown
subclass of: Restriction
  all values from: Identifier
  max cardinality: 1
  on property: TestReport.identifier
subclass of: Restriction
  all values from: TestReportSetupComponent
  max cardinality: 1
  on property: TestReport.setup
subclass of: Restriction
  all values from: TestReportParticipantComponent
  on property: TestReport.participant
subclass of: Restriction
  cardinality: 1
  on property: TestReport.status
  some values from: code
subclass of: Restriction
  all values from: dateTime
  max cardinality: 1
  on property: TestReport.issued

Contract.term.group.action.subject.reference
type: ObjectProperty
comment: The entity the action is performed or not performed on or for.
domain: Contract.TermComponentTerm.ActionComponent.ActionSubjectComponent
range: Reference
title: Entity of the action

CapabilityStatementRestComponent.CapabilityStatementRestResourceComponent.ResourceInteractionComponent
type: Class
comment: Identifies a restful operation supported by the solution.
subclass of: BackboneElement
subclass of: Restriction
  all values from: markdown
  max cardinality: 1
  on property: CapabilityStatement.rest.resource.interaction.documentation
subclass of: Restriction
  cardinality: 1
  on property: CapabilityStatement.rest.resource.interaction.code
  some values from: code

ClaimResponse.processNote.number
type: ObjectProperty
comment: An integer associated with each note which may be referred to from each service line item.
domain: ClaimResponse.NoteComponent
range: positiveInt
title: Sequence Number for this note

DiagnosticReport.imagingStudy
type: ObjectProperty
comment: One or more links to full details of any imaging performed during the diagnostic investigation. Typically, this is imaging performed by DICOM enabled modalities, but this is not required. A fully enabled PACS viewer can use this information to provide views of the source images.
domain: DiagnosticReport
range: Reference
title: Reference to full details of imaging associated with the diagnostic report

Claim.careTeam.role
type: ObjectProperty
comment: The lead, assisting or supervising practitioner and their discipline if a multidisciplinary team.
domain: Claim.CareTeamComponent
range: CodeableConcept
title: Role on the team

ActivityDefinition
type: Class
comment: This resource allows for the definition of some activity to be performed, independent of a particular patient, practitioner, or other performance context.
subclass of: clinical.general
subclass of: DomainResource
subclass of: Restriction
  all values from: markdown
  max cardinality: 1
  on property: ActivityDefinition.copyright
subclass of: Restriction
  all values from: markdown
  max cardinality: 1
  on property: ActivityDefinition.description
subclass of: Restriction
  all values from: code
  max cardinality: 1
  on property: ActivityDefinition.kind
subclass of: Restriction
  all values from: CodeableConcept
  on property: ActivityDefinition.topic
subclass of: Restriction
  all values from: canonical
  max cardinality: 1
  on property: ActivityDefinition.transform
subclass of: Restriction
  all values from: Dosage
  on property: ActivityDefinition.dosage
subclass of: Restriction
  all values from: string
  max cardinality: 1
  on property: ActivityDefinition.subtitle
subclass of: Restriction
  all values from: uri
  max cardinality: 1
  on property: ActivityDefinition.url
subclass of: Restriction
  all values from: dateTime
  max cardinality: 1
  on property: ActivityDefinition.date
subclass of: Restriction
  all values from: CodeableConcept
  max cardinality: 1
  on property: ActivityDefinition.code
subclass of: Restriction
  all values from: Reference
  on property: ActivityDefinition.specimenRequirement
subclass of: Restriction
  all values from: date
  max cardinality: 1
  on property: ActivityDefinition.approvalDate
subclass of:
  union of: Restriction
    all values from: CodeableConcept
    max cardinality: 1
    on property: ActivityDefinition.subjectCodeableConcept
  union of: Restriction
    all values from: Reference
    max cardinality: 1
    on property: ActivityDefinition.subjectReference
subclass of: Restriction
  all values from: ContactDetail
  on property: ActivityDefinition.author
subclass of: Restriction
  all values from: CodeableConcept
  on property: ActivityDefinition.jurisdiction
subclass of: Restriction
  all values from: CodeableConcept
  on property: ActivityDefinition.bodySite
subclass of: Restriction
  all values from: UsageContext
  on property: ActivityDefinition.useContext
subclass of: Restriction
  all values from: canonical
  max cardinality: 1
  on property: ActivityDefinition.profile
subclass of: Restriction
  cardinality: 1
  on property: ActivityDefinition.status
  some values from: code
subclass of: Restriction
  all values from: string
  max cardinality: 1
  on property: ActivityDefinition.publisher
subclass of: Restriction
  all values from: RelatedArtifact
  on property: ActivityDefinition.relatedArtifact
subclass of: Restriction
  all values from: code
  max cardinality: 1
  on property: ActivityDefinition.intent
subclass of: Restriction
  all values from: Reference
  max cardinality: 1
  on property: ActivityDefinition.location
subclass of: Restriction
  all values from: Identifier
  on property: ActivityDefinition.identifier
subclass of: Restriction
  all values from: Reference
  on property: ActivityDefinition.observationRequirement
subclass of:
  union of: Restriction
    all values from: Reference
    max cardinality: 1
    on property: ActivityDefinition.productReference
  union of: Restriction
    all values from: CodeableConcept
    max cardinality: 1
    on property: ActivityDefinition.productCodeableConcept
subclass of: Restriction
  all values from: string
  max cardinality: 1
  on property: ActivityDefinition.name
subclass of: Restriction
  all values from: date
  max cardinality: 1
  on property: ActivityDefinition.lastReviewDate
subclass of: Restriction
  all values from: boolean
  max cardinality: 1
  on property: ActivityDefinition.doNotPerform
subclass of: Restriction
  all values from: ContactDetail
  on property: ActivityDefinition.editor
subclass of: Restriction
  all values from: string
  max cardinality: 1
  on property: ActivityDefinition.usage
subclass of: Restriction
  all values from: Period
  max cardinality: 1
  on property: ActivityDefinition.effectivePeriod
subclass of: Restriction
  all values from: string
  max cardinality: 1
  on property: ActivityDefinition.version
subclass of: Restriction
  all values from: boolean
  max cardinality: 1
  on property: ActivityDefinition.experimental
subclass of: Restriction
  all values from: SimpleQuantity
  max cardinality: 1
  on property: ActivityDefinition.quantity
subclass of:
  union of: Restriction
    all values from: Timing
    max cardinality: 1
    on property: ActivityDefinition.timingTiming
  union of: Restriction
    all values from: dateTime
    max cardinality: 1
    on property: ActivityDefinition.timingDateTime
  union of: Restriction
    all values from: Age
    max cardinality: 1
    on property: ActivityDefinition.timingAge
  union of: Restriction
    all values from: Period
    max cardinality: 1
    on property: ActivityDefinition.timingPeriod
  union of: Restriction
    all values from: Range
    max cardinality: 1
    on property: ActivityDefinition.timingRange
  union of: Restriction
    all values from: Duration
    max cardinality: 1
    on property: ActivityDefinition.timingDuration
subclass of: Restriction
  all values from: ContactDetail
  on property: ActivityDefinition.contact
subclass of: Restriction
  all values from: canonical
  on property: ActivityDefinition.library
subclass of: Restriction
  all values from: ContactDetail
  on property: ActivityDefinition.endorser
subclass of: Restriction
  all values from: string
  max cardinality: 1
  on property: ActivityDefinition.title
subclass of: Restriction
  all values from: code
  max cardinality: 1
  on property: ActivityDefinition.priority
subclass of: Restriction
  all values from: markdown
  max cardinality: 1
  on property: ActivityDefinition.purpose
subclass of: Restriction
  all values from: Reference
  on property: ActivityDefinition.observationResultRequirement
subclass of: Restriction
  all values from: ActivityDefinitionParticipantComponent
  on property: ActivityDefinition.participant
subclass of: Restriction
  all values from: ContactDetail
  on property: ActivityDefinition.reviewer
subclass of: Restriction
  all values from: ActivityDefinitionDynamicValueComponent
  on property: ActivityDefinition.dynamicValue

MedicationKnowledge.administrationGuidelines.dosage
type: ObjectProperty
comment: Dosage for the medication for the specific guidelines.
domain: MedicationKnowledgeAdministrationGuidelinesComponent
range: MedicationKnowledgeAdministrationGuidelinesComponent.MedicationKnowledgeAdministrationGuidelinesDosageComponent
title: Dosage for the medication for the specific guidelines

PlanDefinition.endorser
type: ObjectProperty
comment: An individual or organization responsible for officially endorsing the content for use in some setting.
domain: PlanDefinition
range: ContactDetail
title: Who endorsed the content

StructureDefinition.mapping.identity
type: ObjectProperty
comment: An Internal id that is used to identify this mapping set when specific mappings are made.
domain: StructureDefinitionMappingComponent
range: id
title: Internal id when this mapping is used

Claim.insurance.focal
type: ObjectProperty
comment: A flag to indicate that this Coverage is the focus for adjudication. The Coverage against which the claim is to be adjudicated.
domain: Claim.InsuranceComponent
range: boolean
title: Is the focal Coverage

ClaimResponse.addItem.detail.adjudication.reason
type: ObjectProperty
comment: Adjudication reason such as limit reached.
domain: ClaimResponse.AddedItemComponent.AddedItemDetailComponentAdjudication
range: CodeableConcept
title: Explanation of Adjudication outcome

MedicationAdministration.dosage.site
type: ObjectProperty
comment: A coded specification of the anatomic site where the medication first entered the body. For example, "left arm".
domain: MedicationAdministrationDosageComponent
range: CodeableConcept
title: Body site administered to

SearchParameter.xpathUsage
type: ObjectProperty
comment: How the search parameter relates to the set of elements returned by evaluating the xpath query.
domain: SearchParameter
range: code
title: normal | phonetic | nearby | distance | other

ExampleScenario.process.step.alternative.option.step.operation.response.resourceId
type: ObjectProperty
comment: Each resource contained in the instance.
domain: ExampleScenarioProcessComponent.ExampleScenarioProcessStepComponent.ExampleScenarioProcessStepAlternativeComponent.ExampleScenarioProcessStepAlternativeOptionComponentStep.ExampleScenarioProcessStepOperationComponentContainedInstance
range: string
title: Each resource contained in the instance

MedicinalProductClinicals.contraindication.therapeuticIndication.undesirableEffects.population.gender
type: ObjectProperty
comment: The gender of the specific population.
domain: MedicinalProductClinicalsContraindicationComponentTherapeuticIndicationUndesirableEffects.MedicinalProductClinicalsUndesirableEffectsPopulationComponent
range: CodeableConcept
title: The gender of the specific population

RequestGroup.action.action.resource
type: ObjectProperty
comment: The resource that is the target of the action (e.g. CommunicationRequest).
domain: RequestGroupActionComponentAction
range: Reference
title: The target of the action

PlanDefinition.action.action.input
type: ObjectProperty
comment: Defines input data requirements for the action.
domain: PlanDefinitionActionComponentAction
range: DataRequirement
title: Input data requirements

TestScript.setup.action.assert.headerField
type: ObjectProperty
comment: The HTTP header field name e.g. 'Location'.
domain: TestScriptSetupComponent.SetupActionComponent.SetupActionAssertComponent
range: string
title: HTTP header field name

Appointment.start
type: ObjectProperty
comment: Date/Time that the appointment is to take place.
domain: Appointment
range: instant
sub property of: when.init
title: When appointment is to take place

ElementDefinition.maxValueInstant
type: ObjectProperty
domain: ElementDefinition
range: instant
sub property of: ElementDefinition.maxValue

Schedule.serviceCategory
type: ObjectProperty
comment: A broad categorization of the service that is to be performed during this appointment.
domain: Schedule
range: CodeableConcept
sub property of: class
title: High-level category

ValueSet.expansion.contains.contains.designation
type: ObjectProperty
comment: Additional representations for this item - other languages, aliases, specialized purposes, used for particular purposes, etc. These are relevant when the conditions of the expansion do not fix to a single correct representation.
domain: ValueSetExpansionComponent.ValueSetExpansionContainsComponentContains
range: ValueSetExpansionComponent.ValueSetExpansionContainsComponentContainsDesignation
title: Additional representations for this item

CodeSystem.copyright
type: ObjectProperty
comment: A copyright statement relating to the code system and/or its contents. Copyright statements are generally legal restrictions on the use and publishing of the code system.
domain: CodeSystem
range: markdown
title: Use and/or publishing restrictions

DocumentReference.agent.type
type: ObjectProperty
comment: Specification of the participation type the agent played.
domain: DocumentReferenceAgentComponent
range: CodeableConcept
title: How agent participated

Timing.code
type: ObjectProperty
comment: A code for the timing schedule (or just text in code.text). Some codes such as BID are ubiquitous, but many institutions define their own additional codes. If a code is provided, the code is understood to be a complete statement of whatever is specified in the structured timing data, and either the code or the data may be used to interpret the Timing, with the exception that .repeat.bounds still applies over the code (and is not contained in the code).
domain: Timing
range: CodeableConcept
title: BID | TID | QID | AM | PM | QD | QOD | +

ActivityDefinitionParticipantComponent
type: Class
comment: Indicates who should participate in performing the action described.
subclass of: BackboneElement
subclass of: Restriction
  all values from: CodeableConcept
  max cardinality: 1
  on property: ActivityDefinition.participant.role
subclass of: Restriction
  cardinality: 1
  on property: ActivityDefinition.participant.type
  some values from: code

Encounter.hospitalization.specialCourtesy
type: ObjectProperty
comment: Special courtesies (VIP, board member).
domain: EncounterHospitalizationComponent
range: CodeableConcept
title: Special courtesies (VIP, board member)

MedicationKnowledge.administrationGuidelines.dosage.dosage
type: ObjectProperty
comment: Dosage for the medication for the specific guidelines.
domain: MedicationKnowledgeAdministrationGuidelinesComponent.MedicationKnowledgeAdministrationGuidelinesDosageComponent
range: Dosage
title: Dosage for the medication for the specific guidelines

DocumentReference.relatesTo
type: ObjectProperty
comment: Relationships that this document has with other document references that already exist.
domain: DocumentReference
range: DocumentReferenceRelatesToComponent
title: Relationships to other documents

TerminologyCapabilities.expansion.textFilter
type: ObjectProperty
comment: Documentation about text searching works.
domain: TerminologyCapabilitiesExpansionComponent
range: markdown
title: Documentation about text searching works

CoverageEligibilityRequest.InsuranceComponent
type: Class
comment: Insurance policies which the patient has advised may be applicable for paying for health services.
subclass of: BackboneElement
subclass of: Restriction
  all values from: string
  max cardinality: 1
  on property: CoverageEligibilityRequest.insurance.businessArrangement
subclass of: Restriction
  cardinality: 1
  on property: CoverageEligibilityRequest.insurance.coverage
  some values from: Reference
subclass of: Restriction
  all values from: boolean
  max cardinality: 1
  on property: CoverageEligibilityRequest.insurance.focal

PlanDefinition.goal.target.due
type: ObjectProperty
comment: Indicates the timeframe after the start of the goal in which the goal should be met.
domain: PlanDefinitionGoalComponent.PlanDefinitionGoalTargetComponent
range: Duration
title: Reach goal within

MedicationDispensePerformerComponent
type: Class
comment: Indicates who or what performed the event.
subclass of: BackboneElement
subclass of: Restriction
  cardinality: 1
  on property: MedicationDispense.performer.actor
  some values from: Reference
subclass of: Restriction
  all values from: CodeableConcept
  max cardinality: 1
  on property: MedicationDispense.performer.function

AuditEvent.agent.who
type: ObjectProperty
comment: Reference to who this agent is that was involved in the event.
domain: AuditEventAgentComponent
range: Reference
sub property of: who
title: Identifier of who

FamilyMemberHistoryConditionComponent
type: Class
comment: The significant Conditions (or condition) that the family member had. This is a repeating section to allow a system to represent more than one condition per resource, though there is nothing stopping multiple resources - one per condition.
subclass of: BackboneElement
subclass of: Restriction
  all values from: Annotation
  on property: FamilyMemberHistory.condition.note
subclass of:
  union of: Restriction
    all values from: Age
    max cardinality: 1
    on property: FamilyMemberHistory.condition.onsetAge
  union of: Restriction
    all values from: Range
    max cardinality: 1
    on property: FamilyMemberHistory.condition.onsetRange
  union of: Restriction
    all values from: Period
    max cardinality: 1
    on property: FamilyMemberHistory.condition.onsetPeriod
  union of: Restriction
    all values from: string
    max cardinality: 1
    on property: FamilyMemberHistory.condition.onsetString
subclass of: Restriction
  all values from: CodeableConcept
  max cardinality: 1
  on property: FamilyMemberHistory.condition.outcome
subclass of: Restriction
  cardinality: 1
  on property: FamilyMemberHistory.condition.code
  some values from: CodeableConcept

EntryDefinition.referencedItem
type: ObjectProperty
comment: The item in a catalog or definition.
domain: EntryDefinition
range: Reference
title: The item that is being defined

CarePlan.subject
type: ObjectProperty
comment: Identifies the patient or group whose intended care is described by the plan.
domain: CarePlan
range: Reference
sub property of: who.focus
title: Who the care plan is for

instant
type: Class
comment: An instant in time - known at least to the second
subclass of: Primitive
subclass of: Restriction
  cardinality: 1
  on property: fhir:value
  some values from: Datatype
    on datatype: dateTime

GraphDefinition.url
type: ObjectProperty
comment: An absolute URI that is used to identify this graph definition when it is referenced in a specification, model, design or an instance; also called its canonical identifier. This SHOULD be globally unique and SHOULD be a literal address at which at which an authoritative instance of this graph definition is (or will be) published. This URL can be the target of a canonical reference. It SHALL remain the same when the graph definition is stored on different servers.
domain: GraphDefinition
range: uri
sub property of: id
title: Canonical identifier for this graph definition, represented as a URI (globally unique)

DeviceUseStatement.timingTiming
type: ObjectProperty
domain: DeviceUseStatement
range: Timing
sub property of: DeviceUseStatement.timing

ValueSet.compose.include.valueSet
type: ObjectProperty
comment: Selects the concepts found in this value set (based on its value set definition). This is an absolute URI that is a reference to ValueSet.url. If multiple value sets are specified this includes the union of the contents of all of the referenced value sets.
domain: ValueSetComposeComponent.ConceptSetComponent
range: canonical
title: Select the contents included in this value set

ExampleScenarioProcessComponent.ExampleScenarioProcessStepComponentProcess.ExampleScenarioProcessStepComponentProcess
type: Class
comment: Nested process.
subclass of: BackboneElement
title: Nested process

Device.url
type: ObjectProperty
comment: A network address on which the device may be contacted directly.
domain: Device
range: uri
sub property of: where
title: Network address to contact device

DeviceMetric.calibration.time
type: ObjectProperty
comment: Describes the time last calibration has been performed.
domain: DeviceMetricCalibrationComponent
range: instant
title: Describes the time last calibration has been performed

Device.udiCarrier.issuer
type: ObjectProperty
comment: Organization that is charged with issuing UDIs for devices. For example, the US FDA issuers include : 1) GS1: http://hl7.org/fhir/NamingSystem/gs1-di, 2) HIBCC: http://hl7.org/fhir/NamingSystem/hibcc-dI, 3) ICCBBA for blood containers: http://hl7.org/fhir/NamingSystem/iccbba-blood-di, 4) ICCBA for other devices: http://hl7.org/fhir/NamingSystem/iccbba-other-di.
domain: DeviceUdiCarrierComponent
range: uri
title: UDI Issuing Organization

Contract.term.asset.answer.valueTime
type: ObjectProperty
domain: Contract.TermComponent.ContractAssetComponentAnswer
range: time
sub property of: Contract.term.asset.answer.value

SubstancePolymer.class
type: ObjectProperty
comment: Todo.
domain: SubstancePolymer
range: CodeableConcept
title: Todo

TestScript.test.action.assert.label
type: ObjectProperty
comment: The label would be used for tracking/logging purposes by test engines.
domain: TestScriptTestComponent.TestActionComponentAssert
range: string
title: Tracking/logging assertion label

MessageDefinition.eventUri
type: ObjectProperty
domain: MessageDefinition
range: uri
sub property of: MessageDefinition.event

Immunization.protocolApplied.doseNumberPositiveInt
type: ObjectProperty
domain: ImmunizationProtocolAppliedComponent
range: positiveInt
sub property of: Immunization.protocolApplied.doseNumber

Contract.term.group.action.occurrencePeriod
type: ObjectProperty
domain: Contract.TermComponentTerm.ActionComponent
range: Period
sub property of: Contract.term.group.action.occurrence

ExplanationOfBenefit.procedure.procedureReference
type: ObjectProperty
domain: ExplanationOfBenefit.ProcedureComponent
range: Reference
sub property of: ExplanationOfBenefit.procedure.procedure

ElementDefinition.code
type: ObjectProperty
comment: A code that has the same meaning as the element in a particular terminology.
domain: ElementDefinition
range: Coding
title: Corresponding codes in terminologies

ProcessRequest.ItemsComponent
type: Class
comment: List of top level items to be re-adjudicated, if none specified then the entire submission is re-adjudicated.
subclass of: BackboneElement
subclass of: Restriction
  cardinality: 1
  on property: ProcessRequest.item.sequenceLinkId
  some values from: integer

Claim.diagnosis.diagnosisReference
type: ObjectProperty
domain: Claim.DiagnosisComponent
range: Reference
sub property of: Claim.diagnosis.diagnosis

MedicinalProduct.paediatricUseIndicator
type: ObjectProperty
comment: If authorised for use in children.
domain: MedicinalProduct
range: CodeableConcept
title: If authorised for use in children

CommunicationRequest.reasonCode
type: ObjectProperty
comment: Describes why the request is being made in coded or textual form.
domain: CommunicationRequest
range: CodeableConcept
sub property of: why
title: Why is communication needed?

TestScript.status
type: ObjectProperty
comment: The status of this test script. Enables tracking the life-cycle of the content.
domain: TestScript
range: code
sub property of: status
title: draft | active | retired | unknown

CodeSystem.ConceptDefinitionComponent
type: Class
comment: Concepts that are in the code system. The concept definitions are inherently hierarchical, but the definitions must be consulted to determine what the meaning of the hierarchical relationships are.
subclass of: BackboneElement
subclass of: Restriction
  cardinality: 1
  on property: CodeSystem.concept.code
  some values from: code
subclass of: Restriction
  all values from: CodeSystem.ConceptDefinitionComponentConcept
  on property: CodeSystem.concept.concept
subclass of: Restriction
  all values from: CodeSystem.ConceptDefinitionComponent.ConceptPropertyComponent
  on property: CodeSystem.concept.property
subclass of: Restriction
  all values from: string
  max cardinality: 1
  on property: CodeSystem.concept.display
subclass of: Restriction
  all values from: CodeSystem.ConceptDefinitionComponent.ConceptDefinitionDesignationComponent
  on property: CodeSystem.concept.designation
subclass of: Restriction
  all values from: string
  max cardinality: 1
  on property: CodeSystem.concept.definition

MeasureReport.group.stratifier.stratum.measureScore
type: ObjectProperty
comment: The measure score for this stratum, calculated as appropriate for the measure type and scoring method, and based on only the members of this stratum.
domain: MeasureReportGroupComponent.MeasureReportGroupStratifierComponent.StratifierGroupComponent
range: Quantity
title: What score this stratum achieved

ElementDefinition.constraint.xpath
type: ObjectProperty
comment: An XPath expression of constraint that can be executed to see if this constraint is met.
domain: ElementDefinitionConstraintComponent
range: string
title: XPath expression of constraint

ImplementationGuide.definition.page.name
type: ObjectProperty

Claim.insurance.claimResponse
type: ObjectProperty
comment: The Coverages adjudication details.
domain: Claim.InsuranceComponent
range: Reference
title: Adjudication results

Parameters.parameter.value
type: ObjectProperty
domain: ParametersParameterComponent
range: Element

ExampleScenario.publisher
type: ObjectProperty
comment: The name of the organization or individual that published the example scenario.
domain: ExampleScenario
range: string
sub property of: who.witness
title: Name of the publisher (organization or individual)

Consent.provision.actor
type: ObjectProperty
comment: Who or what is controlled by this rule. Use group to identify a set of actors by some property they share (e.g. 'admitting officers').
domain: Consent.provisionComponent
range: Consent.provisionComponent.provisionActorComponent
title: Who|what controlled by this rule (or group, by role)

ClinicalImpression.prognosisCodeableConcept
type: ObjectProperty
comment: Estimate of likely outcome.
domain: ClinicalImpression
range: CodeableConcept
title: Estimate of likely outcome

DeviceUseStatement.timing
type: ObjectProperty

OperationDefinitionParameterComponentParameter.OperationDefinitionParameterBindingComponent
type: Class
comment: Binds to a value set if this parameter is coded (code, Coding, CodeableConcept).
subclass of: BackboneElement
subclass of: Restriction
  cardinality: 1
  on property: OperationDefinition.parameter.part.binding.valueSet
  some values from: canonical
subclass of: Restriction
  cardinality: 1
  on property: OperationDefinition.parameter.part.binding.strength
  some values from: code

TestScript.setup.action.operation.description
type: ObjectProperty
comment: The description would be used by test engines for tracking and reporting purposes.
domain: TestScriptSetupComponent.SetupActionComponent.SetupActionOperationComponent
range: string
title: Tracking/reporting operation description

RequestGroup.action.action.selectionBehavior
type: ObjectProperty
comment: Defines the selection behavior for the action and its children.
domain: RequestGroupActionComponentAction
range: code
title: any | all | all-or-none | exactly-one | at-most-one | one-or-more

MedicinalProductDeviceSpec.sterilityIndicator
type: ObjectProperty
comment: Whether the device is supplied as sterile.
domain: MedicinalProductDeviceSpec
range: CodeableConcept
title: Whether the device is supplied as sterile

RequestGroup.action.action.priority
type: ObjectProperty
comment: Indicates how quickly the action should be addressed with respect to other actions.
domain: RequestGroupActionComponentAction
range: code
title: routine | urgent | asap | stat

Communication
type: Class
comment: An occurrence of information being transmitted; e.g. an alert that was sent to a responsible provider, a public health agency was notified about a reportable condition.
subclass of: workflow.encounter
subclass of: DomainResource
subclass of: Restriction
  all values from: Reference
  max cardinality: 1
  on property: Communication.sender
subclass of: Restriction
  all values from: Reference
  on property: Communication.recipient
subclass of: Restriction
  all values from: CodeableConcept
  max cardinality: 1
  on property: Communication.topic
subclass of: Restriction
  cardinality: 1
  on property: Communication.status
  some values from: code
subclass of: Restriction
  all values from: Reference
  on property: Communication.basedOn
subclass of: Restriction
  all values from: Reference
  max cardinality: 1
  on property: Communication.subject
subclass of: Restriction
  all values from: Reference
  on property: Communication.inResponseTo
subclass of: Restriction
  all values from: uri
  on property: Communication.instantiatesUri
subclass of: Restriction
  all values from: Annotation
  on property: Communication.note
subclass of: Restriction
  all values from: dateTime
  max cardinality: 1
  on property: Communication.received
subclass of: Restriction
  all values from: Reference
  on property: Communication.partOf
subclass of: Restriction
  all values from: CommunicationPayloadComponent
  on property: Communication.payload
subclass of: Restriction
  all values from: dateTime
  max cardinality: 1
  on property: Communication.sent
subclass of: Restriction
  all values from: CodeableConcept
  on property: Communication.medium
subclass of: Restriction
  all values from: code
  max cardinality: 1
  on property: Communication.priority
subclass of: Restriction
  all values from: canonical
  on property: Communication.instantiatesCanonical
subclass of: Restriction
  all values from: Identifier
  on property: Communication.identifier
subclass of: Restriction
  all values from: Reference
  max cardinality: 1
  on property: Communication.context
subclass of: Restriction
  all values from: CodeableConcept
  on property: Communication.reasonCode
subclass of: Restriction
  all values from: CodeableConcept
  on property: Communication.category
subclass of: Restriction
  all values from: Reference
  on property: Communication.reasonReference
subclass of: Restriction
  all values from: Reference
  on property: Communication.about
subclass of: Restriction
  all values from: CodeableConcept
  max cardinality: 1
  on property: Communication.statusReason

EntryDefinition.orderable
type: ObjectProperty
comment: Whether the entry represents an orderable item.
domain: EntryDefinition
range: boolean
title: Whether the entry represents an orderable item

PlanDefinition.action.action.condition.expression
type: ObjectProperty
comment: An expression that returns true or false, indicating whether the condition is satisfied.
domain: PlanDefinitionActionComponentAction.PlanDefinitionActionConditionComponent
range: Expression
title: Boolean-valued expression

MedicationKnowledgeRegulatoryComponent.MedicationKnowledgeRegulatoryScheduleComponent
type: Class
comment: Specifies the schedule of a medication in jurisdiction.
subclass of: BackboneElement
subclass of: Restriction
  cardinality: 1
  on property: MedicationKnowledge.regulatory.schedule.schedule
  some values from: CodeableConcept

MessageDefinition.replaces
type: ObjectProperty
comment: A MessageDefinition that is superseded by this definition.
domain: MessageDefinition
range: canonical
title: Takes the place of

CapabilityStatement.rest.resource.conditionalRead
type: ObjectProperty
comment: A code that indicates how the server supports conditional read.
domain: CapabilityStatementRestComponent.CapabilityStatementRestResourceComponent
range: code
title: not-supported | modified-since | not-match | full-support

ValueSet.immutable
type: ObjectProperty
comment: If this is set to 'true', then no new versions of the content logical definition can be created. Note: Other metadata might still change.
domain: ValueSet
range: boolean
title: Indicates whether or not any change to the content logical definition may occur

ExampleScenario.process.step.alternative.option.step.process.step.operation.response.versionId
type: ObjectProperty
comment: A specific version of a resource contained in the instance.
domain: Each resource instance used by the initiator
range: string
title: A specific version of a resource contained in the instance

Sequence.quality.type
type: ObjectProperty
comment: INDEL / SNP / Undefined variant.
domain: SequenceQualityComponent
range: code
title: indel | snp | unknown

StructureMap.group.rule.target.parameter.valueString
type: ObjectProperty
domain: StructureMapGroupComponent.StructureMapGroupRuleComponent.StructureMapGroupRuleTargetComponent.StructureMapGroupRuleTargetParameterComponent
range: string
sub property of: StructureMap.group.rule.target.parameter.value

MedicinalProductUndesirableEffect.population.race
type: ObjectProperty
comment: Race of the specific population.
domain: MedicinalProductUndesirableEffectPopulationComponent
range: CodeableConcept
title: Race of the specific population

Contract.term.action.occurrenceTiming
type: ObjectProperty
domain: Contract.TermComponent.ActionComponent
range: Timing
sub property of: Contract.term.action.occurrence

Questionnaire.item.maxLength
type: ObjectProperty
comment: The maximum number of characters that are permitted in the answer to be considered a "valid" QuestionnaireResponse.
domain: QuestionnaireItemComponent
range: integer
title: No more than this many characters

ExplanationOfBenefit.item.billcode
type: ObjectProperty
comment: If this is an actual service or product line, i.e. not a Group, then use code to indicate the Professional Service or Product supplied (e.g. CTP, HCPCS,USCLS,ICD10, NCPDP,DIN,ACHI,CCI). If a grouping item then use a group code to indicate the type of thing being grouped eg. 'glasses' or 'compound'.
domain: ExplanationOfBenefit.ItemComponent
range: CodeableConcept
title: Billing Code

ImplementationGuide.manifest.resource
type: ObjectProperty
comment: A resource that is part of the implementation guide. Conformance resources (value set, structure definition, capability statements etc.) are obvious candidates for inclusion, but any kind of resource can be included as an example resource.
domain: ImplementationGuideManifestComponent
range: ImplementationGuideManifestComponent.ManifestResourceComponent
title: Resource in the implementation guide

SubstanceReferenceInformation.geneElement
type: ObjectProperty
comment: Todo.
domain: SubstanceReferenceInformation
range: SubstanceReferenceInformationGeneElementComponent
title: Todo

Questionnaire.experimental
type: ObjectProperty
comment: A Boolean value to indicate that this questionnaire is authored for testing purposes (or education/evaluation/marketing) and is not intended to be used for genuine usage.
domain: Questionnaire
range: boolean
sub property of: class
title: For testing purposes, not real usage

EnrollmentResponse.request
type: ObjectProperty
comment: Original request resource reference.
domain: EnrollmentResponse
range: Reference
title: Claim reference

SubstanceReferenceInformationRelationshipComponent
type: Class
comment: Todo.
subclass of: BackboneElement
subclass of: Restriction
  all values from: CodeableConcept
  max cardinality: 1
  on property: SubstanceReferenceInformation.relationship.interaction
subclass of: Restriction
  all values from: string
  max cardinality: 1
  on property: SubstanceReferenceInformation.relationship.amountText
subclass of: Restriction
  all values from: boolean
  max cardinality: 1
  on property: SubstanceReferenceInformation.relationship.isDefining
subclass of:
  union of: Restriction
    all values from: Reference
    max cardinality: 1
    on property: SubstanceReferenceInformation.relationship.substanceReference
  union of: Restriction
    all values from: CodeableConcept
    max cardinality: 1
    on property: SubstanceReferenceInformation.relationship.substanceCodeableConcept
subclass of: Restriction
  all values from: CodeableConcept
  max cardinality: 1
  on property: SubstanceReferenceInformation.relationship.relationship
subclass of: Restriction
  all values from: CodeableConcept
  max cardinality: 1
  on property: SubstanceReferenceInformation.relationship.amountType
subclass of: Restriction
  all values from: Reference
  on property: SubstanceReferenceInformation.relationship.source
subclass of:
  union of: Restriction
    all values from: Quantity
    max cardinality: 1
    on property: SubstanceReferenceInformation.relationship.amountQuantity
  union of: Restriction
    all values from: Range
    max cardinality: 1
    on property: SubstanceReferenceInformation.relationship.amountRange
  union of: Restriction
    all values from: string
    max cardinality: 1
    on property: SubstanceReferenceInformation.relationship.amountString

TerminologyCapabilities.name
type: ObjectProperty
comment: A natural language name identifying the terminology capabilities. This name should be usable as an identifier for the module by machine processing applications such as code generation.
domain: TerminologyCapabilities
range: string
title: Name for this terminology capabilities (computer friendly)

ExampleScenario.process.step.process.preConditions
type: ObjectProperty
comment: Description of initial status before the process starts.
domain: ExampleScenarioProcessComponent.ExampleScenarioProcessStepComponentProcess
range: markdown
title: Description of initial status before the process starts

ValueSetComposeComponentInclude
type: Class
comment: Exclude one or more codes from the value set based on code system filters and/or other value sets.
subclass of: BackboneElement
subclass of: Restriction
  all values from: string
  max cardinality: 1
  on property: ValueSet.compose.exclude.version
subclass of: Restriction
  all values from: ValueSetComposeComponentInclude.ConceptReferenceComponent
  on property: ValueSet.compose.exclude.concept
subclass of: Restriction
  all values from: ValueSetComposeComponentInclude.ConceptSetFilterComponent
  on property: ValueSet.compose.exclude.filter
subclass of: Restriction
  all values from: canonical
  on property: ValueSet.compose.exclude.valueSet
subclass of: Restriction
  all values from: uri
  max cardinality: 1
  on property: ValueSet.compose.exclude.system
title: Explicitly exclude codes from a code system or other value sets

EnrollmentResponse.organization
type: ObjectProperty
comment: The Insurer who produced this adjudicated response.
domain: EnrollmentResponse
range: Reference
sub property of: who.actor
title: Insurer

CapabilityStatement.rest.resource.versioning
type: ObjectProperty
comment: This field is set to no-version to specify that the system does not support (server) or use (client) versioning for this resource type. If this has some other value, the server must at least correctly track and populate the versionId meta-property on resources. If the value is 'versioned-update', then the server supports all the versioning features, including using e-tags for version integrity in the API.
domain: CapabilityStatementRestComponent.CapabilityStatementRestResourceComponent
range: code
title: no-version | versioned | versioned-update

MedicinalProductClinicals.contraindication.therapeuticIndication.population.gender
type: ObjectProperty
comment: The gender of the specific population.
domain: MedicinalProductClinicalsContraindicationComponentTherapeuticIndicationPopulation
range: CodeableConcept
title: The gender of the specific population

ImplementationGuide.copyright
type: ObjectProperty
comment: A copyright statement relating to the implementation guide and/or its contents. Copyright statements are generally legal restrictions on the use and publishing of the implementation guide.
domain: ImplementationGuide
range: markdown
title: Use and/or publishing restrictions

ImplementationGuide.global.profile
type: ObjectProperty
comment: A reference to the profile that all instances must conform to.
domain: ImplementationGuideGlobalComponent
range: canonical
title: Profile that all resources must conform to

CodeSystem.concept
type: ObjectProperty
comment: Concepts that are in the code system. The concept definitions are inherently hierarchical, but the definitions must be consulted to determine what the meaning of the hierarchical relationships are.
domain: CodeSystem
range: CodeSystem.ConceptDefinitionComponent
title: Concepts in the code system

Invoice.lineItem.chargeItemReference
type: ObjectProperty
domain: InvoiceLineItemComponent
range: Reference
sub property of: Invoice.lineItem.chargeItem

ChargeItemDefinition.partOf
type: ObjectProperty
comment: A larger definition of which this particular definition is a component or step.
domain: ChargeItemDefinition
range: canonical
title: A larger definition of which this particular definition is a component or step

ClaimResponse.addItem.detail.subDetail.modifier
type: ObjectProperty
comment: Item typification or modifiers codes, e.g. for Oral whether the treatment is cosmetic or associated with TMJ, or for medical whether the treatment was outside the clinic or out of office hours.
domain: ClaimResponse.AddedItemComponent.AddedItemDetailComponent.AddedItemSubDetailComponent
range: CodeableConcept
title: Service/Product billing modifiers

ExplanationOfBenefit.careTeam.sequence
type: ObjectProperty
comment: Sequence of careteam which serves to order and provide a link.
domain: ExplanationOfBenefit.CareTeamComponent
range: positiveInt
title: Number to convey order of careteam

ExplanationOfBenefit.diagnosis.onAdmission
type: ObjectProperty
comment: Indication of whether the diagnosis was present on admission to a facility.
domain: ExplanationOfBenefit.DiagnosisComponent
range: CodeableConcept
title: Present on admission

Contract.ComputableLanguageComponent
type: Class
comment: List of Computable Policy Rule Language Representations of this Contract.
subclass of: BackboneElement
subclass of:
  union of: Restriction
    cardinality: 1
    on property: Contract.rule.contentAttachment
    some values from: Attachment
  union of: Restriction
    cardinality: 1
    on property: Contract.rule.contentReference
    some values from: Reference

EventDefinition.subjectCodeableConcept
type: ObjectProperty
domain: EventDefinition
range: CodeableConcept
sub property of: EventDefinition.subject

MedicationDispenseSubstitutionComponent
type: Class
comment: Indicates whether or not substitution was made as part of the dispense. In some cases substitution will be expected but does not happen, in other cases substitution is not expected but does happen. This block explains what substitution did or did not happen and why. If nothing is specified, substitution was not done.
subclass of: BackboneElement
subclass of: Restriction
  all values from: Reference
  on property: MedicationDispense.substitution.responsibleParty
subclass of: Restriction
  all values from: CodeableConcept
  on property: MedicationDispense.substitution.reason
subclass of: Restriction
  all values from: CodeableConcept
  max cardinality: 1
  on property: MedicationDispense.substitution.type
subclass of: Restriction
  cardinality: 1
  on property: MedicationDispense.substitution.wasSubstituted
  some values from: boolean

Contract.term.action.occurrence
type: ObjectProperty

Immunization
type: Class
comment: Describes the event of a patient being administered a vaccine or a record of an immunization as reported by a patient, a clinician or another party.
subclass of: DomainResource
subclass of: clinical.medication
subclass of: Restriction
  all values from: Reference
  max cardinality: 1
  on property: Immunization.manufacturer
subclass of: Restriction
  all values from: boolean
  max cardinality: 1
  on property: Immunization.primarySource
subclass of: Restriction
  all values from: ImmunizationEducationComponent
  on property: Immunization.education
subclass of: Restriction
  all values from: CodeableConcept
  max cardinality: 1
  on property: Immunization.statusReason
subclass of: Restriction
  all values from: Reference
  on property: Immunization.reasonReference
subclass of: Restriction
  cardinality: 1
  on property: Immunization.vaccineCode
  some values from: CodeableConcept
subclass of: Restriction
  all values from: ImmunizationPerformerComponent
  on property: Immunization.performer
subclass of: Restriction
  all values from: CodeableConcept
  on property: Immunization.subpotentReason
subclass of: Restriction
  all values from: CodeableConcept
  max cardinality: 1
  on property: Immunization.route
subclass of: Restriction
  all values from: string
  max cardinality: 1
  on property: Immunization.lotNumber
subclass of: Restriction
  all values from: CodeableConcept
  max cardinality: 1
  on property: Immunization.reportOrigin
subclass of: Restriction
  all values from: CodeableConcept
  on property: Immunization.programEligibility
subclass of: Restriction
  all values from: Identifier
  on property: Immunization.identifier
subclass of:
  union of: Restriction
    cardinality: 1
    on property: Immunization.occurrenceDateTime
    some values from: dateTime
  union of: Restriction
    cardinality: 1
    on property: Immunization.occurrenceString
    some values from: string
subclass of: Restriction
  all values from: Reference
  max cardinality: 1
  on property: Immunization.encounter
subclass of: Restriction
  all values from: ImmunizationProtocolAppliedComponent
  on property: Immunization.protocolApplied
subclass of: Restriction
  all values from: dateTime
  max cardinality: 1
  on property: Immunization.recorded
subclass of: Restriction
  cardinality: 1
  on property: Immunization.patient
  some values from: Reference
subclass of: Restriction
  all values from: Annotation
  on property: Immunization.note
subclass of: Restriction
  all values from: SimpleQuantity
  max cardinality: 1
  on property: Immunization.doseQuantity
subclass of: Restriction
  all values from: date
  max cardinality: 1
  on property: Immunization.expirationDate
subclass of: Restriction
  all values from: Reference
  max cardinality: 1
  on property: Immunization.location
subclass of: Restriction
  all values from: CodeableConcept
  max cardinality: 1
  on property: Immunization.fundingSource
subclass of: Restriction
  cardinality: 1
  on property: Immunization.status
  some values from: code
subclass of: Restriction
  all values from: CodeableConcept
  on property: Immunization.reasonCode
subclass of: Restriction
  all values from: boolean
  max cardinality: 1
  on property: Immunization.isSubpotent
subclass of: Restriction
  all values from: CodeableConcept
  max cardinality: 1
  on property: Immunization.site

CapabilityStatement.rest.compartment
type: ObjectProperty
comment: An absolute URI which is a reference to the definition of a compartment that the system supports. The reference is to a CompartmentDefinition resource by its canonical URL .
domain: CapabilityStatementRestComponent
range: canonical
title: Compartments served/used by system

SubstanceSpecification.property.amount
type: ObjectProperty
comment: Quantitative value for this property.
domain: SubstanceSpecificationPropertyComponent
range: string
title: Quantitative value for this property

DetectedIssue.patient
type: ObjectProperty
comment: Indicates the patient whose record the detected issue is associated with.
domain: DetectedIssue
range: Reference
sub property of: who.focus
title: Associated patient

MedicationKnowledge.intendedRoute
type: ObjectProperty
comment: The intended or approved route of administration.
domain: MedicationKnowledge
range: CodeableConcept
title: The intended or approved route of administration

Communication.received
type: ObjectProperty
comment: The time when this communication arrived at the destination.
domain: Communication
range: dateTime
sub property of: when.done
title: When received

Immunization.status
type: ObjectProperty
comment: Indicates the current status of the immunization event.
domain: Immunization
range: code
sub property of: status
title: completed | entered-in-error | not-done

SupplyRequest.occurrence
type: ObjectProperty

ActivityDefinition.intent
type: ObjectProperty
comment: Indicates the level of authority/intentionality associated with the activity and where the request should fit into the workflow chain.
domain: ActivityDefinition
range: code
title: proposal | plan | order

Location.telecom
type: ObjectProperty
comment: The contact details of communication devices available at the location. This can include phone numbers, fax numbers, mobile numbers, email addresses and web sites.
domain: Location
range: ContactPoint
title: Contact details of the location

ImmunizationRecommendation.recommendation.supportingPatientInformation
type: ObjectProperty
comment: Patient Information that supports the status and recommendation. This includes patient observations, adverse reactions and allergy/intolerance information.
domain: ImmunizationRecommendationRecommendationComponent
range: Reference
title: Patient observations supporting recommendation

FamilyMemberHistory.patient
type: ObjectProperty
comment: The person who this history concerns.
domain: FamilyMemberHistory
range: Reference
sub property of: who.focus
title: Patient history is about

SubstanceReferenceInformation.relationship.amountQuantity
type: ObjectProperty
domain: SubstanceReferenceInformationRelationshipComponent
range: Quantity
sub property of: SubstanceReferenceInformation.relationship.amount

TestScript.test.action.assert.sourceId
type: ObjectProperty
comment: Fixture to evaluate the XPath/JSONPath expression or the headerField against.
domain: TestScriptTestComponent.TestActionComponentAssert
range: id
title: Fixture Id of source expression or headerField

RequestGroup.action.relatedAction.offsetRange
type: ObjectProperty
domain: RequestGroupActionComponent.RequestGroupActionRelatedActionComponent
range: Range
sub property of: RequestGroup.action.relatedAction.offset

MedicinalProductIngredientSubstanceComponentStrength.MedicinalProductIngredientSpecifiedSubstanceStrengthReferenceStrengthComponent
type: Class
comment: Strength expressed in terms of a reference substance.
subclass of: BackboneElement
subclass of: Restriction
  all values from: CodeableConcept
  on property: MedicinalProductIngredient.substance.strength.referenceStrength.country
subclass of: Restriction
  all values from: string
  max cardinality: 1
  on property: MedicinalProductIngredient.substance.strength.referenceStrength.measurementPoint
subclass of: Restriction
  cardinality: 1
  on property: MedicinalProductIngredient.substance.strength.referenceStrength.strength
  some values from: Ratio
subclass of: Restriction
  all values from: CodeableConcept
  max cardinality: 1
  on property: MedicinalProductIngredient.substance.strength.referenceStrength.substance

PaymentReconciliation.detail.submitter
type: ObjectProperty
comment: The Organization which submitted the claim or financial transaction.
domain: PaymentReconciliation.DetailsComponent
range: Reference
title: Organization which submitted the claim

Task.restriction
type: ObjectProperty
comment: If the Task.focus is a request resource and the task is seeking fulfillment (i.e. is asking for the request to be actioned), this element identifies any limitations on what parts of the referenced request should be actioned.
domain: Task
range: TaskRestrictionComponent
title: Constraints on fulfillment tasks

MedicationRequest.basedOn
type: ObjectProperty
comment: A plan or request that is fulfilled in whole or in part by this medication request.
domain: MedicationRequest
range: Reference
title: What request fulfills

Sequence.quality.precision
type: ObjectProperty
comment: QUERY.TP / (QUERY.TP + QUERY.FP).
domain: SequenceQualityComponent
range: decimal
title: Precision of comparison

Contract.contentDefinition.publicationDate
type: ObjectProperty
comment: The date (and optionally time) when the contract was published. The date must change when the business version changes and it must change if the status code changes. In addition, it should change when the substantive content of the contract changes.
domain: Contract.ContentDefinitionComponent
range: dateTime
title: When published

OperationDefinition.purpose
type: ObjectProperty
comment: Explanation of why this operation definition is needed and why it has been designed as it has.
domain: OperationDefinition
range: markdown
sub property of: why
title: Why this operation definition is defined

TriggerDefinition.timingTiming
type: ObjectProperty
domain: TriggerDefinition
range: Timing
sub property of: TriggerDefinition.timing

TestReport.setup.action.assert
type: ObjectProperty
comment: The results of the assertion performed on the previous operations.
domain: TestReportSetupComponent.SetupActionComponent
range: TestReportSetupComponent.SetupActionComponent.SetupActionAssertComponent
title: The assertion to perform

Substance.ingredient.quantity
type: ObjectProperty
comment: The amount of the ingredient in the substance - a concentration ratio.
domain: SubstanceIngredientComponent
range: Ratio
title: Optional amount (concentration)

TestScript.setup.action.assert.description
type: ObjectProperty
comment: The description would be used by test engines for tracking and reporting purposes.
domain: TestScriptSetupComponent.SetupActionComponent.SetupActionAssertComponent
range: string
title: Tracking/reporting assertion description

Claim.item.detail.category
type: ObjectProperty
comment: Health Care Service Type Codes to identify the classification of service or benefits.
domain: Claim.ItemComponent.DetailComponent
range: CodeableConcept
title: Type of service or product

MessageDefinition.description
type: ObjectProperty
comment: A free text natural language description of the message definition from a consumer's perspective.
domain: MessageDefinition
range: markdown
title: Natural language description of the message definition

ExplanationOfBenefit.item.servicedPeriod
type: ObjectProperty
domain: ExplanationOfBenefit.ItemComponent
range: Period
sub property of: ExplanationOfBenefit.item.serviced

CommunicationRequest.requester
type: ObjectProperty
comment: The device, individual, or organization who initiated the request and has responsibility for its activation.
domain: CommunicationRequest
range: Reference
sub property of: who.author
title: Who/what is requesting service

RelatedPerson.photo
type: ObjectProperty
comment: Image of the person.
domain: RelatedPerson
range: Attachment
title: Image of the person

Contract.term.group.asset.condition
type: ObjectProperty
comment: Description of the quality and completeness of the asset that imay be a factor in its valuation.
domain: Contract.TermComponentTerm.ContractAssetComponent
range: string
title: Quality desctiption of asset

Contract.term.group.asset.valuedItem.points
type: ObjectProperty
comment: An amount that expresses the weighting (based on difficulty, cost and/or resource intensiveness) associated with the Contract Valued Item delivered. The concept of Points allows for assignment of point values for a Contract Valued Item, such that a monetary amount can be assigned to each point.
domain: Contract.TermComponentTerm.ContractAssetComponent.ValuedItemComponent
range: decimal
sub property of: what
title: Contract Valued Item Difficulty Scaling Factor

TerminologyCapabilities
type: Class
comment: A Terminology Capabilities documents a set of capabilities (behaviors) of a FHIR Server that may be used as a statement of actual server functionality or a statement of required or desired server implementation.
subclass of: conformance.behavior
subclass of: DomainResource
subclass of: Restriction
  all values from: markdown
  max cardinality: 1
  on property: TerminologyCapabilities.purpose
subclass of: Restriction
  all values from: TerminologyCapabilitiesSoftwareComponent
  max cardinality: 1
  on property: TerminologyCapabilities.software
subclass of: Restriction
  all values from: string
  max cardinality: 1
  on property: TerminologyCapabilities.version
subclass of: Restriction
  cardinality: 1
  on property: TerminologyCapabilities.status
  some values from: code
subclass of: Restriction
  all values from: CodeableConcept
  on property: TerminologyCapabilities.jurisdiction
subclass of: Restriction
  all values from: boolean
  max cardinality: 1
  on property: TerminologyCapabilities.lockedDate
subclass of: Restriction
  all values from: boolean
  max cardinality: 1
  on property: TerminologyCapabilities.experimental
subclass of: Restriction
  all values from: TerminologyCapabilitiesImplementationComponent
  max cardinality: 1
  on property: TerminologyCapabilities.implementation
subclass of: Restriction
  all values from: TerminologyCapabilitiesValidateCodeComponent
  max cardinality: 1
  on property: TerminologyCapabilities.validateCode
subclass of: Restriction
  all values from: UsageContext
  on property: TerminologyCapabilities.useContext
subclass of: Restriction
  all values from: TerminologyCapabilitiesClosureComponent
  max cardinality: 1
  on property: TerminologyCapabilities.closure
subclass of: Restriction
  all values from: markdown
  max cardinality: 1
  on property: TerminologyCapabilities.copyright
subclass of: Restriction
  all values from: code
  max cardinality: 1
  on property: TerminologyCapabilities.codeSearch
subclass of: Restriction
  cardinality: 1
  on property: TerminologyCapabilities.kind
  some values from: code
subclass of: Restriction
  all values from: string
  max cardinality: 1
  on property: TerminologyCapabilities.name
subclass of: Restriction
  all values from: uri
  max cardinality: 1
  on property: TerminologyCapabilities.url
subclass of: Restriction
  all values from: string
  max cardinality: 1
  on property: TerminologyCapabilities.title
subclass of: Restriction
  all values from: TerminologyCapabilitiesExpansionComponent
  max cardinality: 1
  on property: TerminologyCapabilities.expansion
subclass of: Restriction
  cardinality: 1
  on property: TerminologyCapabilities.date
  some values from: dateTime
subclass of: Restriction
  all values from: TerminologyCapabilitiesTranslationComponent
  max cardinality: 1
  on property: TerminologyCapabilities.translation
subclass of: Restriction
  all values from: ContactDetail
  on property: TerminologyCapabilities.contact
subclass of: Restriction
  all values from: string
  max cardinality: 1
  on property: TerminologyCapabilities.publisher
subclass of: Restriction
  all values from: markdown
  max cardinality: 1
  on property: TerminologyCapabilities.description
subclass of: Restriction
  all values from: TerminologyCapabilitiesCodeSystemComponent
  on property: TerminologyCapabilities.codeSystem

MedicinalProductClinicals.therapeuticIndication.population.age
type: ObjectProperty

StructureMap.group.rule.source.max
type: ObjectProperty
comment: Specified maximum cardinality for the element - a number or a "*". This is optional; if present, it acts an implicit check on the input content (* just serves as documentation; it's the default value).
domain: StructureMapGroupComponent.StructureMapGroupRuleComponent.StructureMapGroupRuleSourceComponent
range: string
title: Specified maximum cardinality (number or *)

CodeSystem.concept.property.code
type: ObjectProperty
comment: A code that is a reference to CodeSystem.property.code.
domain: CodeSystem.ConceptDefinitionComponent.ConceptPropertyComponent
range: code
title: Reference to CodeSystem.property.code

Task
type: Class
comment: A task to be performed.
subclass of: DomainResource
subclass of: workflow.order
subclass of: Restriction
  all values from: Period
  max cardinality: 1
  on property: Task.executionPeriod
subclass of: Restriction
  all values from: CodeableConcept
  max cardinality: 1
  on property: Task.code
subclass of: Restriction
  cardinality: 1
  on property: Task.intent
  some values from: code
subclass of: Restriction
  all values from: Reference
  on property: Task.insurance
subclass of: Restriction
  all values from: Identifier
  max cardinality: 1
  on property: Task.groupIdentifier
subclass of: Restriction
  all values from: code
  max cardinality: 1
  on property: Task.priority
subclass of: Restriction
  all values from: CodeableConcept
  max cardinality: 1
  on property: Task.businessStatus
subclass of: Restriction
  all values from: CodeableConcept
  on property: Task.performerType
subclass of: Restriction
  all values from: Reference
  on property: Task.basedOn
subclass of: Restriction
  all values from: Reference
  max cardinality: 1
  on property: Task.reasonReference
subclass of: Restriction
  all values from: Task.ParameterComponent
  on property: Task.input
subclass of: Restriction
  all values from: Reference
  max cardinality: 1
  on property: Task.requester
subclass of: Restriction
  all values from: Reference
  max cardinality: 1
  on property: Task.focus
subclass of: Restriction
  all values from: Reference
  on property: Task.relevantHistory
subclass of: Restriction
  cardinality: 1
  on property: Task.status
  some values from: code
subclass of: Restriction
  all values from: string
  max cardinality: 1
  on property: Task.description
subclass of: Restriction
  all values from: Identifier
  on property: Task.identifier
subclass of: Restriction
  all values from: Reference
  max cardinality: 1
  on property: Task.location
subclass of: Restriction
  all values from: Reference
  on property: Task.partOf
subclass of: Restriction
  all values from: Annotation
  on property: Task.note
subclass of: Restriction
  all values from: Reference
  max cardinality: 1
  on property: Task.owner
subclass of: Restriction
  all values from: CodeableConcept
  max cardinality: 1
  on property: Task.statusReason
subclass of: Restriction
  all values from: Reference
  max cardinality: 1
  on property: Task.context
subclass of: Restriction
  all values from: TaskOutputComponent
  on property: Task.output
subclass of: Restriction
  all values from: uri
  max cardinality: 1
  on property: Task.instantiatesUri
subclass of: Restriction
  all values from: CodeableConcept
  max cardinality: 1
  on property: Task.reasonCode
subclass of: Restriction
  all values from: TaskRestrictionComponent
  max cardinality: 1
  on property: Task.restriction
subclass of: Restriction
  all values from: Reference
  max cardinality: 1
  on property: Task.for
subclass of: Restriction
  all values from: dateTime
  max cardinality: 1
  on property: Task.lastModified
subclass of: Restriction
  all values from: canonical
  max cardinality: 1
  on property: Task.instantiatesCanonical
subclass of: Restriction
  all values from: dateTime
  max cardinality: 1
  on property: Task.authoredOn

Contract.term.offer.answer.valueCoding
type: ObjectProperty
domain: Contract.TermComponent.ContractOfferComponent.AnswerComponent
range: Coding
sub property of: Contract.term.offer.answer.value

EpisodeOfCare.team
type: ObjectProperty
comment: The list of practitioners that may be facilitating this episode of care for specific purposes.
domain: EpisodeOfCare
range: Reference
title: Other practitioners facilitating this episode of care

SubstanceReferenceInformation.gene.gene
type: ObjectProperty
comment: Todo.
domain: SubstanceReferenceInformationGeneComponent
range: CodeableConcept
title: Todo

SearchParameter.xpath
type: ObjectProperty
comment: An XPath expression that returns a set of elements for the search parameter.
domain: SearchParameter
range: string
title: XPath that extracts the values

ElementDefinition.constraint.expression
type: ObjectProperty
comment: A [FHIRPath](fhirpath.html) expression of constraint that can be executed to see if this constraint is met.
domain: ElementDefinitionConstraintComponent
range: string
title: FHIRPath expression of constraint

Composition.identifier
type: ObjectProperty
comment: A version-independent identifier for the Composition. This identifier stays constant as the composition is changed over time.
domain: Composition
range: Identifier
sub property of: id
title: Version-independent identifier for the Composition

Media.device
type: ObjectProperty
comment: The device used to collect the media.
domain: Media
range: Reference
title: Observing Device

ChargeItemDefinition.propertyGroup
type: ObjectProperty
comment: Group of properties which are applicable under the same conditions. If no applicability rules are established for the group, then all properties always apply.
domain: ChargeItemDefinition
range: ChargeItemDefinitionPropertyGroupComponent
title: Group of properties which are applicable under the same conditions

ExplanationOfBenefit.information.timingDate
type: ObjectProperty
domain: ExplanationOfBenefit.SupportingInformationComponent
range: date
sub property of: ExplanationOfBenefit.information.timing

Contract.term.offer.answer.valueTime
type: ObjectProperty
domain: Contract.TermComponent.ContractOfferComponent.AnswerComponent
range: time
sub property of: Contract.term.offer.answer.value

OperationOutcome.issue
type: ObjectProperty
comment: An error, warning or information message that results from a system action.
domain: OperationOutcome
range: OperationOutcomeIssueComponent
title: A single issue associated with the action

StructureDefinition.date
type: ObjectProperty
comment: The date (and optionally time) when the structure definition was published. The date must change when the business version changes and it must change if the status code changes. In addition, it should change when the substantive content of the structure definition changes.
domain: StructureDefinition
range: dateTime
sub property of: when.recorded
title: Date last changed

ImagingStudy.series.instance.number
type: ObjectProperty
comment: The number of instance in the series.
domain: ImagingStudySeriesComponent.ImagingStudySeriesInstanceComponent
range: unsignedInt
title: The number of this instance in the series

MessageDefinition.focus.code
type: ObjectProperty
comment: The kind of resource that must be the focus for this message.
domain: MessageDefinitionFocusComponent
range: code
title: Type of resource

TimingRepeatComponent
type: Class
comment: A set of rules that describe when the event is scheduled.
subclass of: Element
subclass of: Restriction
  all values from: decimal
  max cardinality: 1
  on property: Timing.repeat.durationMax
subclass of: Restriction
  all values from: time
  on property: Timing.repeat.timeOfDay
subclass of: Restriction
  all values from: positiveInt
  max cardinality: 1
  on property: Timing.repeat.frequency
subclass of: Restriction
  all values from: positiveInt
  max cardinality: 1
  on property: Timing.repeat.countMax
subclass of: Restriction
  all values from: unsignedInt
  max cardinality: 1
  on property: Timing.repeat.offset
subclass of: Restriction
  all values from: decimal
  max cardinality: 1
  on property: Timing.repeat.period
subclass of: Restriction
  all values from: code
  max cardinality: 1
  on property: Timing.repeat.durationUnit
subclass of: Restriction
  all values from: positiveInt
  max cardinality: 1
  on property: Timing.repeat.count
subclass of: Restriction
  all values from: decimal
  max cardinality: 1
  on property: Timing.repeat.periodMax
subclass of: Restriction
  all values from: code
  on property: Timing.repeat.dayOfWeek
subclass of: Restriction
  all values from: positiveInt
  max cardinality: 1
  on property: Timing.repeat.frequencyMax
subclass of:
  union of: Restriction
    all values from: Duration
    max cardinality: 1
    on property: Timing.repeat.boundsDuration
  union of: Restriction
    all values from: Range
    max cardinality: 1
    on property: Timing.repeat.boundsRange
  union of: Restriction
    all values from: Period
    max cardinality: 1
    on property: Timing.repeat.boundsPeriod
subclass of: Restriction
  all values from: decimal
  max cardinality: 1
  on property: Timing.repeat.duration
subclass of: Restriction
  all values from: code
  on property: Timing.repeat.when
subclass of: Restriction
  all values from: code
  max cardinality: 1
  on property: Timing.repeat.periodUnit

ClaimResponse.addItem.detail.adjudication.category
type: ObjectProperty
comment: Code indicating: Co-Pay, deductible, eligible, benefit, tax, etc.
domain: ClaimResponse.AddedItemComponent.AddedItemDetailComponentAdjudication
range: CodeableConcept
title: Adjudication category such as co-pay, eligible, benefit, etc.

MedicinalProductClinicals.contraindication.therapeuticIndication.undesirableEffects.population.race
type: ObjectProperty
comment: Race of the specific population.
domain: MedicinalProductClinicalsContraindicationComponentTherapeuticIndicationUndesirableEffects.MedicinalProductClinicalsUndesirableEffectsPopulationComponent
range: CodeableConcept
title: Race of the specific population

MedicationAdministration.dosage.rateQuantity
type: ObjectProperty
domain: MedicationAdministrationDosageComponent
range: SimpleQuantity
sub property of: MedicationAdministration.dosage.rate

RequestGroup.note
type: ObjectProperty
comment: Provides a mechanism to communicate additional information about the response.
domain: RequestGroup
range: Annotation
title: Additional notes about the response

VerificationResult.attestation.date
type: ObjectProperty
comment: The date the information was attested to.
domain: VerificationResultAttestationComponent
range: date
title: The date the information was attested to

Location.hoursOfOperation.openingTime
type: ObjectProperty
comment: Time that the Location opens.
domain: LocationHoursOfOperationComponent
range: time
title: Time that the Location opens

ExplanationOfBenefit.item.detail.subDetail.factor
type: ObjectProperty
comment: A real number that represents a multiplier used in determining the overall value of services delivered and/or goods received. The concept of a Factor allows for a discount or surcharge multiplier to be applied to a monetary amount.
domain: ExplanationOfBenefit.ItemComponent.DetailComponent.SubDetailComponent
range: decimal
title: Price scaling factor

ExampleScenario.process.step.alternative.option.step.pause
type: ObjectProperty
comment: If there is a pause in the flow.
domain: ExampleScenarioProcessComponent.ExampleScenarioProcessStepComponent.ExampleScenarioProcessStepAlternativeComponent.ExampleScenarioProcessStepAlternativeOptionComponentStep
range: boolean
title: If there is a pause in the flow

Contract.signer.type
type: ObjectProperty
comment: Role of this Contract signer, e.g. notary, grantee.
domain: Contract.SignatoryComponent
range: Coding
sub property of: who.actor
title: Contract Signatory Role

MedicinalProductClinicals.therapeuticIndication.population.ageCodeableConcept
type: ObjectProperty
domain: MedicinalProductClinicalsTherapeuticIndicationComponentPopulation
range: CodeableConcept
sub property of: MedicinalProductClinicals.therapeuticIndication.population.age

MedicinalProductClinicals.therapeuticIndication.otherTherapy
type: ObjectProperty
comment: Information about the use of the medicinal product in relation to other therapies described as part of the indication.
domain: MedicinalProductClinicalsTherapeuticIndicationComponent
range: MedicinalProductClinicalsTherapeuticIndicationComponent.MedicinalProductClinicalsTherapeuticIndicationOtherTherapyComponent
title: Information about the use of the medicinal product in relation to other therapies described as part of the indication

PlanDefinition.library
type: ObjectProperty
comment: A reference to a Library resource containing any formal logic used by the plan definition.
domain: PlanDefinition
range: canonical
title: Logic used by the plan definition

TestScriptFixtureComponent
type: Class
comment: Fixture in the test script - by reference (uri). All fixtures are required for the test script to execute.
subclass of: BackboneElement
subclass of: Restriction
  all values from: Reference
  max cardinality: 1
  on property: TestScript.fixture.resource
subclass of: Restriction
  cardinality: 1
  on property: TestScript.fixture.autodelete
  some values from: boolean
subclass of: Restriction
  cardinality: 1
  on property: TestScript.fixture.autocreate
  some values from: boolean

MedicinalProductIngredient.specifiedSubstance.strength.referenceStrength.measurementPoint
type: ObjectProperty
comment: For when strength is measured at a particular point or distance.
domain: MedicinalProductIngredientSpecifiedSubstanceComponent.MedicinalProductIngredientSpecifiedSubstanceStrengthComponent.MedicinalProductIngredientSpecifiedSubstanceStrengthReferenceStrengthComponent
range: string
title: For when strength is measured at a particular point or distance

MedicationStatement.partOf
type: ObjectProperty
comment: A larger event of which this particular event is a component or step.
domain: MedicationStatement
range: Reference
title: Part of referenced event

CarePlan.activity.detail.scheduledPeriod
type: ObjectProperty
domain: CarePlanActivityComponent.CarePlanActivityDetailComponent
range: Period
sub property of: CarePlan.activity.detail.scheduled

EnrollmentRequest.insurer
type: ObjectProperty
comment: The Insurer who is target of the request.
domain: EnrollmentRequest
range: Reference
title: Target

NutritionOrder.enteralFormula.additiveProductName
type: ObjectProperty
comment: The product or brand name of the type of modular component to be added to the formula.
domain: NutritionOrderEnteralFormulaComponent
range: string
title: Product or brand name of the modular additive

Claim.item.billcode
type: ObjectProperty
comment: If this is an actual service or product line, i.e. not a Group, then use code to indicate the Professional Service or Product supplied (e.g. CTP, HCPCS,USCLS,ICD10, NCPDP,DIN,RxNorm,ACHI,CCI). If a grouping item then use a group code to indicate the type of thing being grouped e.g. 'glasses' or 'compound'.
domain: Claim.ItemComponent
range: CodeableConcept
title: Billing Code

SpecimenDefinition.specimenToLab.type
type: ObjectProperty
comment: The kind of specimen conditioned for testing expected by lab.
domain: SpecimenDefinitionSpecimenToLabComponent
range: CodeableConcept
title: Type of intended specimen

PlanDefinition.goal.description
type: ObjectProperty
comment: Human-readable and/or coded description of a specific desired objective of care, such as "control blood pressure" or "negotiate an obstacle course" or "dance with child at wedding".
domain: PlanDefinitionGoalComponent
range: CodeableConcept
title: Code or text describing the goal

SubstanceReferenceInformation.classification.domain
type: ObjectProperty
comment: Todo.
domain: SubstanceReferenceInformationClassificationComponent
range: CodeableConcept
title: Todo

TestScript.setup.action.assert.rule
type: ObjectProperty
comment: The TestScript.rule this assert will evaluate.
domain: TestScriptSetupComponent.SetupActionComponent.SetupActionAssertComponent
range: TestScriptSetupComponent.SetupActionComponent.SetupActionAssertComponent.ActionAssertRuleComponent
title: The reference to a TestScript.rule

Resource.id
type: ObjectProperty
comment: The logical id of the resource, as used in the URL for the resource. Once assigned, this value never changes.
domain: Resource
range: id
title: Logical id of this artifact

ElementDefinition.type
type: ObjectProperty
comment: The data type or resource that the value of this element is permitted to be.
domain: ElementDefinition
range: ElementDefinition.TypeRefComponent
title: Data type and Profile for this element

QuestionnaireItemComponent.QuestionnaireItemEnableWhenComponent
type: Class
comment: A constraint indicating that this item should only be enabled (displayed/allow answers to be captured) when the specified condition is true.
subclass of: BackboneElement
subclass of:
  union of: Restriction
    cardinality: 1
    on property: Questionnaire.item.enableWhen.answerBoolean
    some values from: boolean
  union of: Restriction
    cardinality: 1
    on property: Questionnaire.item.enableWhen.answerDecimal
    some values from: decimal
  union of: Restriction
    cardinality: 1
    on property: Questionnaire.item.enableWhen.answerInteger
    some values from: integer
  union of: Restriction
    cardinality: 1
    on property: Questionnaire.item.enableWhen.answerDate
    some values from: date
  union of: Restriction
    cardinality: 1
    on property: Questionnaire.item.enableWhen.answerDateTime
    some values from: dateTime
  union of: Restriction
    cardinality: 1
    on property: Questionnaire.item.enableWhen.answerTime
    some values from: time
  union of: Restriction
    cardinality: 1
    on property: Questionnaire.item.enableWhen.answerString
    some values from: string
  union of: Restriction
    cardinality: 1
    on property: Questionnaire.item.enableWhen.answerCoding
    some values from: Coding
  union of: Restriction
    cardinality: 1
    on property: Questionnaire.item.enableWhen.answerQuantity
    some values from: Quantity
  union of: Restriction
    cardinality: 1
    on property: Questionnaire.item.enableWhen.answerReference
    some values from: Reference
subclass of: Restriction
  cardinality: 1
  on property: Questionnaire.item.enableWhen.operator
  some values from: code
subclass of: Restriction
  cardinality: 1
  on property: Questionnaire.item.enableWhen.question
  some values from: string

ChargeItemDefinition.propertyGroup.priceComponent.type
type: ObjectProperty
comment: This code identifies the type of the component.
domain: ChargeItemDefinitionPropertyGroupComponent.ChargeItemDefinitionPropertyGroupPriceComponentComponent
range: code
title: base | surcharge | deduction | discount | tax | informational

Immunization.subpotentReason
type: ObjectProperty
comment: Reason why a dose is considered to be subpotent.
domain: Immunization
range: CodeableConcept
title: Reason for being subpotent

Questionnaire.item
type: ObjectProperty
comment: A particular question, question grouping or display text that is part of the questionnaire.
domain: Questionnaire
range: QuestionnaireItemComponent
title: Questions and sections within the Questionnaire

RequestGroupActionComponent
type: Class
comment: The actions, if any, produced by the evaluation of the artifact.
subclass of: BackboneElement
subclass of: Restriction
  all values from: RequestGroupActionComponentAction
  on property: RequestGroup.action.action
subclass of: Restriction
  all values from: RelatedArtifact
  on property: RequestGroup.action.documentation
subclass of: Restriction
  all values from: Reference
  max cardinality: 1
  on property: RequestGroup.action.resource
subclass of: Restriction
  all values from: RequestGroupActionComponent.RequestGroupActionConditionComponent
  on property: RequestGroup.action.condition
subclass of: Restriction
  all values from: code
  max cardinality: 1
  on property: RequestGroup.action.cardinalityBehavior
subclass of:
  union of: Restriction
    all values from: dateTime
    max cardinality: 1
    on property: RequestGroup.action.timingDateTime
  union of: Restriction
    all values from: Age
    max cardinality: 1
    on property: RequestGroup.action.timingAge
  union of: Restriction
    all values from: Period
    max cardinality: 1
    on property: RequestGroup.action.timingPeriod
  union of: Restriction
    all values from: Duration
    max cardinality: 1
    on property: RequestGroup.action.timingDuration
  union of: Restriction
    all values from: Range
    max cardinality: 1
    on property: RequestGroup.action.timingRange
  union of: Restriction
    all values from: Timing
    max cardinality: 1
    on property: RequestGroup.action.timingTiming
subclass of: Restriction
  all values from: Reference
  on property: RequestGroup.action.participant
subclass of: Restriction
  all values from: code
  max cardinality: 1
  on property: RequestGroup.action.requiredBehavior
subclass of: Restriction
  all values from: string
  max cardinality: 1
  on property: RequestGroup.action.textEquivalent
subclass of: Restriction
  all values from: code
  max cardinality: 1
  on property: RequestGroup.action.selectionBehavior
subclass of: Restriction
  all values from: code
  max cardinality: 1
  on property: RequestGroup.action.groupingBehavior
subclass of: Restriction
  all values from: string
  max cardinality: 1
  on property: RequestGroup.action.prefix
subclass of: Restriction
  all values from: RequestGroupActionComponent.RequestGroupActionRelatedActionComponent
  on property: RequestGroup.action.relatedAction
subclass of: Restriction
  all values from: string
  max cardinality: 1
  on property: RequestGroup.action.description
subclass of: Restriction
  all values from: CodeableConcept
  on property: RequestGroup.action.code
subclass of: Restriction
  all values from: CodeableConcept
  max cardinality: 1
  on property: RequestGroup.action.type
subclass of: Restriction
  all values from: code
  max cardinality: 1
  on property: RequestGroup.action.priority
subclass of: Restriction
  all values from: code
  max cardinality: 1
  on property: RequestGroup.action.precheckBehavior
subclass of: Restriction
  all values from: string
  max cardinality: 1
  on property: RequestGroup.action.title

AllergyIntolerance.patient
type: ObjectProperty
comment: The patient who has the allergy or intolerance.
domain: AllergyIntolerance
range: Reference
sub property of: who.focus
title: Who the sensitivity is for

MedicinalProductIndication.population.gender
type: ObjectProperty
comment: The gender of the specific population.
domain: MedicinalProductIndicationPopulationComponent
range: CodeableConcept
title: The gender of the specific population

ConceptMap.group.element.target.code
type: ObjectProperty
comment: Identity (code or path) or the element/item that the map refers to.
domain: ConceptMapGroupComponent.SourceElementComponent.TargetElementComponent
range: code
title: Code that identifies the target element

ResearchStudy.partOf
type: ObjectProperty
comment: A larger research study of which this particular study is a component or step.
domain: ResearchStudy
range: Reference
title: Part of larger study

StructureDefinition.context.type
type: ObjectProperty
comment: Defines how to interpret the expression that defines what the context of the extension is.
domain: StructureDefinitionContextComponent
range: code
title: fhirpath | element | extension

ValueSet.expansion.contains.inactive
type: ObjectProperty
comment: If the concept is inactive in the code system that defines it. Inactive codes are those that are no longer to be used, but are maintained by the code system for understanding legacy data. It might not be known or specified whether an concept is inactive (and it may depend on the context of use).
domain: ValueSetExpansionComponent.ValueSetExpansionContainsComponent
range: boolean
title: If concept is inactive in the code system

ValueSet.compose.include.concept.designation.value
type: ObjectProperty
comment: The text value for this designation.
domain: ValueSetComposeComponent.ConceptSetComponent.ConceptReferenceComponent.ConceptReferenceDesignationComponent
range: string
title: The text value for this designation

CapabilityStatement.format
type: ObjectProperty
comment: A list of the formats supported by this implementation using their content types.
domain: CapabilityStatement
range: code
title: formats supported (xml | json | ttl | mime type)

Slot
type: Class
comment: A slot of time on a schedule that may be available for booking appointments.
subclass of: DomainResource
subclass of: workflow.scheduling
subclass of: Restriction
  cardinality: 1
  on property: Slot.status
  some values from: code
subclass of: Restriction
  all values from: boolean
  max cardinality: 1
  on property: Slot.overbooked
subclass of: Restriction
  all values from: CodeableConcept
  on property: Slot.specialty
subclass of: Restriction
  all values from: string
  max cardinality: 1
  on property: Slot.comment
subclass of: Restriction
  all values from: CodeableConcept
  max cardinality: 1
  on property: Slot.appointmentType
subclass of: Restriction
  cardinality: 1
  on property: Slot.start
  some values from: instant
subclass of: Restriction
  all values from: CodeableConcept
  on property: Slot.serviceCategory
subclass of: Restriction
  cardinality: 1
  on property: Slot.end
  some values from: instant
subclass of: Restriction
  all values from: CodeableConcept
  on property: Slot.serviceType
subclass of: Restriction
  all values from: Identifier
  on property: Slot.identifier
subclass of: Restriction
  cardinality: 1
  on property: Slot.schedule
  some values from: Reference

CoverageEligibilityRequest.status
type: ObjectProperty
comment: The status of the resource instance.
domain: CoverageEligibilityRequest
range: code
sub property of: status
title: active | cancelled | draft | entered-in-error

PractitionerRole.organization
type: ObjectProperty
comment: The organization where the Practitioner performs the roles associated.
domain: PractitionerRole
range: Reference
title: Organization where the roles are available

Media.partOf
type: ObjectProperty
comment: A larger event of which this particular event is a component or step.
domain: Media
range: Reference
title: Part of referenced event

TestReportTeardownComponent.TeardownActionComponentOperation
type: Class
comment: An operation would involve a REST request to a server.
subclass of: BackboneElement
subclass of: Restriction
  all values from: uri
  max cardinality: 1
  on property: TestReport.teardown.action.operation.detail
subclass of: Restriction
  all values from: markdown
  max cardinality: 1
  on property: TestReport.teardown.action.operation.message
subclass of: Restriction
  cardinality: 1
  on property: TestReport.teardown.action.operation.result
  some values from: code
title: The teardown operation performed

ExplanationOfBenefit.addItem.detail.subDetail.adjudication.amount
type: ObjectProperty
comment: Monitory amount associated with the code.
domain: ExplanationOfBenefit.AddedItemComponent.AddedItemDetailComponent.AddedItemDetailSubDetailComponentAdjudication
range: Money
title: Monetary amount

CoverageEligibilityRequest.DetailsComponent
type: Class
comment: A list of service types or billable services for which bebefit details and/or an authorization prior to service delivery may be required by the payor.
subclass of: BackboneElement
subclass of: Restriction
  all values from: Reference
  max cardinality: 1
  on property: CoverageEligibilityRequest.item.facility
subclass of: Restriction
  all values from: Money
  max cardinality: 1
  on property: CoverageEligibilityRequest.item.unitPrice
subclass of: Restriction
  all values from: SimpleQuantity
  max cardinality: 1
  on property: CoverageEligibilityRequest.item.quantity
subclass of: Restriction
  all values from: Reference
  max cardinality: 1
  on property: CoverageEligibilityRequest.item.provider
subclass of: Restriction
  all values from: Reference
  on property: CoverageEligibilityRequest.item.detail
subclass of: Restriction
  all values from: CodeableConcept
  on property: CoverageEligibilityRequest.item.modifier
subclass of: Restriction
  all values from: CoverageEligibilityRequest.DetailsComponent.DiagnosisComponent
  on property: CoverageEligibilityRequest.item.diagnosis
subclass of: Restriction
  all values from: CodeableConcept
  max cardinality: 1
  on property: CoverageEligibilityRequest.item.billcode
subclass of: Restriction
  all values from: CodeableConcept
  max cardinality: 1
  on property: CoverageEligibilityRequest.item.category
subclass of: Restriction
  all values from: positiveInt
  on property: CoverageEligibilityRequest.item.supportingInformationSequence

TestScript.teardown.action.operation.responseId
type: ObjectProperty
comment: The fixture id (maybe new) to map to the response.
domain: TestScriptTeardownComponent.TeardownActionComponentOperation
range: id
title: Fixture Id of mapped response

UserSession.context.value
type: ObjectProperty

Sequence.quality.end
type: ObjectProperty
comment: End position of the sequence.If the coordinate system is 0-based then end is is exclusive and does not include the last position. If the coordinate system is 1-base, then end is inclusive and includes the last position.
domain: SequenceQualityComponent
range: integer
title: End position of the sequence

MedicinalProductPharmaceutical.characteristics.status
type: ObjectProperty
comment: The status of characteristic e.g. assigned or pending.
domain: MedicinalProductPharmaceuticalCharacteristicsComponent
range: CodeableConcept
title: The status of characteristic e.g. assigned or pending

MedicinalProduct.manufacturingBusinessOperation.authorisationReferenceNumber
type: ObjectProperty
comment: Regulatory authorization reference number.
domain: MedicinalProductManufacturingBusinessOperationComponent
range: Identifier
title: Regulatory authorization reference number

PlanDefinition.title
type: ObjectProperty
comment: A short, descriptive, user-friendly title for the plan definition.
domain: PlanDefinition
range: string
title: Name for this plan definition (human friendly)

DeviceDefinitionPropertyComponent
type: Class
comment: The actual configuration settings of a device as it actually operates, e.g., regulation status, time properties.
subclass of: BackboneElement
subclass of: Restriction
  all values from: CodeableConcept
  on property: DeviceDefinition.property.valueCode
subclass of: Restriction
  all values from: Quantity
  on property: DeviceDefinition.property.valueQuanity
subclass of: Restriction
  cardinality: 1
  on property: DeviceDefinition.property.type
  some values from: CodeableConcept

Timing.repeat.boundsRange
type: ObjectProperty
domain: TimingRepeatComponent
range: Range
sub property of: Timing.repeat.bounds

QuestionnaireItemComponentItemItem
type: Class
comment: Text, questions and other groups to be nested beneath a question or group.
subclass of: BackboneElement
title: Nested questionnaire items

RequestGroup.action.resource
type: ObjectProperty
comment: The resource that is the target of the action (e.g. CommunicationRequest).
domain: RequestGroupActionComponent
range: Reference
title: The target of the action

markdown
type: Class
comment: A string that may contain Github Flavored Markdown syntax for optional processing by a mark down presentation engine
subclass of: Primitive
subclass of: Restriction
  cardinality: 1
  on property: fhir:value
  some values from: Datatype
    on datatype: string

DeviceRequest.parameter.code
type: ObjectProperty
comment: A code or string that identifies the device detail being asserted.
domain: DeviceRequestParameterComponent
range: CodeableConcept
sub property of: what
title: Device detail

CarePlan.activity.detail.instantiatesCanonical
type: ObjectProperty
comment: The URL pointing to a FHIR-defined protocol, guideline, questionnaire or other definition that is adhered to in whole or in part by this CarePlan activity.
domain: CarePlanActivityComponent.CarePlanActivityDetailComponent
range: canonical
title: Instantiates FHIR protocol or definition

CarePlan.activity.detail.scheduled
type: ObjectProperty

ExplanationOfBenefit.item.detail.subDetail.adjudication.reason
type: ObjectProperty
comment: Adjudication reason such as limit reached.
domain: ExplanationOfBenefit.ItemComponent.DetailComponent.SubDetailComponentAdjudication
range: CodeableConcept
title: Explanation of Adjudication outcome

CompartmentDefinition.purpose
type: ObjectProperty
comment: Explanation of why this compartment definition is needed and why it has been designed as it has.
domain: CompartmentDefinition
range: markdown
sub property of: why
title: Why this compartment definition is defined

Appointment.requestedPeriod
type: ObjectProperty
comment: A set of date ranges (potentially including times) that the appointment is preferred to be scheduled within. When using these values, the duration (usually in minutes) should be provided to indicate the length of the appointment to fill and populate the start/end times for the actual allocated time.
domain: Appointment
range: Period
title: Potential date/time interval(s) requested to allocate the appointment within

TestScript.test.action.assert.requestMethod
type: ObjectProperty
comment: The request method or HTTP operation code to compare against that used by the client system under test.
domain: TestScriptTestComponent.TestActionComponentAssert
range: code
title: delete | get | options | patch | post | put

Goal.target.detailCodeableConcept
type: ObjectProperty
domain: GoalTargetComponent
range: CodeableConcept
sub property of: Goal.target.detail

ExplanationOfBenefit.diagnosis.packageCode
type: ObjectProperty
comment: The package billing code, for example DRG, based on the assigned grouping code system.
domain: ExplanationOfBenefit.DiagnosisComponent
range: CodeableConcept
title: Package billing code

SubstanceSpecification.moiety.stereochemistry
type: ObjectProperty
comment: Stereochemistry type.
domain: SubstanceSpecificationMoietyComponent
range: CodeableConcept
title: Stereochemistry type

MedicationRequest.insurance
type: ObjectProperty
comment: Insurance plans, coverage extensions, pre-authorizations and/or pre-determinations that may be required for delivering the requested service.
domain: MedicationRequest
range: Reference
title: Associated insurance coverage

StructureMap.version
type: ObjectProperty
comment: The identifier that is used to identify this version of the structure map when it is referenced in a specification, model, design or instance. This is an arbitrary value managed by the structure map author and is not expected to be globally unique. For example, it might be a timestamp (e.g. yyyymmdd) if a managed version is not available. There is also no expectation that versions can be placed in a lexicographical sequence.
domain: StructureMap
range: string
sub property of: id.version
title: Business version of the structure map

TestScript.rule.param.value
type: ObjectProperty
comment: The explicit or dynamic value for the parameter that will be passed on to the external rule template.
domain: TestScriptRuleComponent.RuleParamComponent
range: string
title: Parameter value defined either explicitly or dynamically

StructureMap.identifier
type: ObjectProperty
comment: A formal identifier that is used to identify this structure map when it is represented in other formats, or referenced in a specification, model, design or an instance.
domain: StructureMap
range: Identifier
sub property of: id
title: Additional identifier for the structure map

NamingSystem.kind
type: ObjectProperty
comment: Indicates the purpose for the naming system - what kinds of things does it make unique?
domain: NamingSystem
range: code
sub property of: class
title: codesystem | identifier | root

CarePlanActivityComponent
type: Class
comment: Identifies a planned action to occur as part of the plan. For example, a medication to be used, lab tests to perform, self-monitoring, education, etc.
subclass of: BackboneElement
subclass of: Restriction
  all values from: CarePlanActivityComponent.CarePlanActivityDetailComponent
  max cardinality: 1
  on property: CarePlan.activity.detail
subclass of: Restriction
  all values from: Reference
  max cardinality: 1
  on property: CarePlan.activity.reference
subclass of: Restriction
  all values from: Annotation
  on property: CarePlan.activity.progress
subclass of: Restriction
  all values from: Reference
  on property: CarePlan.activity.outcomeReference
subclass of: Restriction
  all values from: CodeableConcept
  on property: CarePlan.activity.outcomeCodeableConcept

ExplanationOfBenefit.item.detail.billcode
type: ObjectProperty
comment: If this is an actual service or product line, i.e. not a Group, then use code to indicate the Professional Service or Product supplied (e.g. CTP, HCPCS,USCLS,ICD10, NCPDP,DIN,ACHI,CCI). If a grouping item then use a group code to indicate the type of thing being grouped eg. 'glasses' or 'compound'.
domain: ExplanationOfBenefit.ItemComponent.DetailComponent
range: CodeableConcept
title: Billing Code

Device.version.value
type: ObjectProperty
comment: The version text.
domain: DeviceVersionComponent
range: string
title: The version text

SearchParameter.experimental
type: ObjectProperty
comment: A Boolean value to indicate that this search parameter is authored for testing purposes (or education/evaluation/marketing) and is not intended to be used for genuine usage.
domain: SearchParameter
range: boolean
sub property of: class
title: For testing purposes, not real usage

DeviceDefinition.shelfLifeStorage
type: ObjectProperty
comment: Shelf Life and storage information.
domain: DeviceDefinition
range: ProductShelfLife
title: Shelf Life and storage information

ExplanationOfBenefit.item.detail.udi
type: ObjectProperty
comment: List of Unique Device Identifiers associated with this line item.
domain: ExplanationOfBenefit.ItemComponent.DetailComponent
range: Reference
title: Unique Device Identifier

DetectedIssue.date
type: ObjectProperty
comment: The date or date-time when the detected issue was initially identified.
domain: DetectedIssue
range: dateTime
sub property of: when.recorded
title: When identified

SupplyRequest.occurrenceTiming
type: ObjectProperty
domain: SupplyRequest
range: Timing
sub property of: SupplyRequest.occurrence

EpisodeOfCare.diagnosis.role
type: ObjectProperty
comment: Role that this diagnosis has within the episode of care (e.g. admission, billing, discharge …).
domain: EpisodeOfCare.DiagnosisComponent
range: CodeableConcept
title: Role that this diagnosis has within the episode of care (e.g. admission, billing, discharge …)

CareTeam.note
type: ObjectProperty
comment: Comments made about the CareTeam.
domain: CareTeam
range: Annotation
title: Comments made about the CareTeam

ExplanationOfBenefit.addItem.adjudication
type: ObjectProperty
comment: The adjudication results.
domain: ExplanationOfBenefit.AddedItemComponent
range: ExplanationOfBenefit.AddedItemComponentAdjudication
title: Added items adjudication

Questionnaire.item.item.definition
type: ObjectProperty
comment: This element is a URI that refers to an [ElementDefinition] that provides information about this item, including information that might otherwise be included in the instance of the Questionnaire resource. A detailed description of the construction of the URI is shown in Comments, below. If this element is present then the following element values MAY be derived from the Element Definition if the corresponding elements of this Questionnaire resource instance have no value: * code (ElementDefinition.code) * type (ElementDefinition.type) * required (ElementDefinition.min) * repeats (ElementDefinition.max) * maxLength (ElementDefinition.maxLength) * answerValueSet (ElementDefinition.binding) * options (ElementDefinition.binding).
domain: QuestionnaireItemComponentItem
range: uri
title: ElementDefinition - details for the item

Contract.term.securityLabel.number
type: ObjectProperty
comment: Number used to link this term or term element to the applicable Security Label.
domain: Contract.TermComponent.SecurityLabelComponent
range: unsignedInt
title: Link to Security Labels

ProvenanceAgentComponent
type: Class
comment: An actor taking a role in an activity for which it can be assigned some degree of responsibility for the activity taking place.
subclass of: BackboneElement
subclass of: Restriction
  all values from: Reference
  max cardinality: 1
  on property: Provenance.agent.onBehalfOf
subclass of: Restriction
  cardinality: 1
  on property: Provenance.agent.who
  some values from: Reference
subclass of: Restriction
  all values from: CodeableConcept
  on property: Provenance.agent.role
subclass of: Restriction
  all values from: CodeableConcept
  max cardinality: 1
  on property: Provenance.agent.type

ExampleScenario.actor.type
type: ObjectProperty
comment: The type of actor - person or system.
domain: ExampleScenarioActorComponent
range: code
title: person | entity

SubstanceSpecification.structure.isotope.molecularWeight.type
type: ObjectProperty
comment: Type of molecular weight such as exact, average (also known as. number average), weight average.
domain: SubstanceSpecificationStructureComponent.SubstanceSpecificationStructureIsotopeComponent.SubstanceSpecificationStructureIsotopeMolecularWeightComponent
range: CodeableConcept
title: Type of molecular weight such as exact, average (also known as. number average), weight average

RequestGroup.code
type: ObjectProperty
comment: A code that identifies what the overall request group is.
domain: RequestGroup
range: CodeableConcept
sub property of: what
title: What's being requested/ordered

DeviceRequest.groupIdentifier
type: ObjectProperty
comment: Composite request this is part of.
domain: DeviceRequest
range: Identifier
title: Identifier of composite request

ImagingStudy.series.modality
type: ObjectProperty
comment: The modality of this series sequence.
domain: ImagingStudySeriesComponent
range: Coding
title: The modality of the instances in the series

ExampleScenarioProcessComponent.ExampleScenarioProcessStepComponent
type: Class
comment: Each step of the process.
subclass of: BackboneElement
subclass of: Restriction
  all values from: ExampleScenarioProcessComponent.ExampleScenarioProcessStepComponent.ExampleScenarioProcessStepAlternativeComponent
  max cardinality: 1
  on property: ExampleScenario.process.step.alternative
subclass of: Restriction
  all values from: ExampleScenarioProcessComponent.ExampleScenarioProcessStepComponent.ExampleScenarioProcessStepOperationComponent
  max cardinality: 1
  on property: ExampleScenario.process.step.operation
subclass of: Restriction
  all values from: boolean
  max cardinality: 1
  on property: ExampleScenario.process.step.pause
subclass of: Restriction
  all values from: ExampleScenarioProcessComponent.ExampleScenarioProcessStepComponentProcess
  on property: ExampleScenario.process.step.process

VisionPrescription.reason
type: ObjectProperty

ActivityDefinition.dosage
type: ObjectProperty
comment: Provides detailed dosage instructions in the same way that they are described for MedicationRequest resources.
domain: ActivityDefinition
range: Dosage
title: Detailed dosage instructions

Composition.section.mode
type: ObjectProperty
comment: How the entry list was prepared - whether it is a working list that is suitable for being maintained on an ongoing basis, or if it represents a snapshot of a list of items from another source, or whether it is a prepared list where items may be marked as added, modified or deleted.
domain: Composition.SectionComponent
range: code
sub property of: class
title: working | snapshot | changes

Measure.compositeScoring
type: ObjectProperty
comment: If this is a composite measure, the scoring method used to combine the component measures to determine the composite score.
domain: Measure
range: CodeableConcept
title: opportunity | all-or-nothing | linear | weighted

Contract.term.action.linkId
type: ObjectProperty
comment: Id [identifier??] of the clause or question text related to this action in the referenced form or QuestionnaireResponse.
domain: Contract.TermComponent.ActionComponent
range: string
title: Pointer to specific item

QuestionnaireResponse.identifier
type: ObjectProperty
comment: A business identifier assigned to a particular completed (or partially completed) questionnaire.
domain: QuestionnaireResponse
range: Identifier
sub property of: id
title: Unique id for this set of answers

TestScript.test.action.operation.requestId
type: ObjectProperty
comment: The fixture id (maybe new) to map to the request.
domain: TestScriptTestComponent.TestActionComponentOperation
range: id
title: Fixture Id of mapped request

DeviceMetric.calibration.state
type: ObjectProperty
comment: Describes the state of the calibration.
domain: DeviceMetricCalibrationComponent
range: code
title: not-calibrated | calibration-required | calibrated | unspecified

Patient.contact.address
type: ObjectProperty
comment: Address for the contact person.
domain: Patient.ContactComponent
range: Address
title: Address for the contact person

Claim.related
type: ObjectProperty
comment: Other claims which are related to this claim such as prior claim versions or for related services.
domain: Claim
range: Claim.RelatedClaimComponent
title: Related Claims which may be relevant to processing this claim

Contract.term.offer.answer
type: ObjectProperty
comment: Response to offer text.
domain: Contract.TermComponent.ContractOfferComponent
range: Contract.TermComponent.ContractOfferComponent.AnswerComponent
title: Response to offer text

NamingSystem.uniqueId.period
type: ObjectProperty
comment: Identifies the period of time over which this identifier is considered appropriate to refer to the naming system. Outside of this window, the identifier might be non-deterministic.
domain: NamingSystemUniqueIdComponent
range: Period
title: When is identifier valid?

SubstanceReferenceInformation.relationship.amountRange
type: ObjectProperty
domain: SubstanceReferenceInformationRelationshipComponent
range: Range
sub property of: SubstanceReferenceInformation.relationship.amount

Questionnaire.item.readOnly
type: ObjectProperty
comment: An indication, when true, that the value cannot be changed by a human respondent to the Questionnaire.
domain: QuestionnaireItemComponent
range: boolean
title: Don't allow human editing

Slot.overbooked
type: ObjectProperty
comment: This slot has already been overbooked, appointments are unlikely to be accepted for this time.
domain: Slot
range: boolean
title: This slot has already been overbooked, appointments are unlikely to be accepted for this time

ChargeItemDefinition.url
type: ObjectProperty
comment: An absolute URI that is used to identify this charge item definition when it is referenced in a specification, model, design or an instance; also called its canonical identifier. This SHOULD be globally unique and SHOULD be a literal address at which at which an authoritative instance of this charge item definition is (or will be) published. This URL can be the target of a canonical reference. It SHALL remain the same when the charge item definition is stored on different servers.
domain: ChargeItemDefinition
range: uri
sub property of: id
title: Canonical identifier for this charge item definition, represented as a URI (globally unique)

Extension.value
type: ObjectProperty
domain: Extension
range: Element

PractitionerRole.notAvailable
type: ObjectProperty
comment: The practitioner is not available or performing this role during this period of time due to the provided reason.
domain: PractitionerRole
range: PractitionerRoleNotAvailableComponent
title: Not available during this time due to provided reason

TerminologyCapabilities.useContext
type: ObjectProperty
comment: The content was developed with a focus and intent of supporting the contexts that are listed. These terms may be used to assist with indexing and searching for appropriate terminology capabilities instances.
domain: TerminologyCapabilities
range: UsageContext
title: The context that the content is intended to support

MedicinalProductUndesirableEffect.population.gender
type: ObjectProperty
comment: The gender of the specific population.
domain: MedicinalProductUndesirableEffectPopulationComponent
range: CodeableConcept
title: The gender of the specific population

Claim.item.detail.subDetail.programCode
type: ObjectProperty
comment: For programs which require reson codes for the inclusion, covering, of this billed item under the program or sub-program.
domain: Claim.ItemComponent.DetailComponent.SubDetailComponent
range: CodeableConcept
title: Program specific reason for item inclusion

FamilyMemberHistory.name
type: ObjectProperty
comment: This will either be a name or a description; e.g. "Aunt Susan", "my cousin with the red hair".
domain: FamilyMemberHistory
range: string
title: The family member described

Invoice.recipient
type: ObjectProperty
comment: The individual or Organization responsible for balancing of this invoice.
domain: Invoice
range: Reference
title: Recipient of this invoice

Task.output.type
type: ObjectProperty
comment: The name of the Output parameter.
domain: TaskOutputComponent
range: CodeableConcept
title: Label for output

DeviceUseStatement.reasonReference
type: ObjectProperty
comment: Indicates another resource whose existence justifies this DeviceUseStatement.
domain: DeviceUseStatement
range: Reference
sub property of: why
title: Why was DeviceUseStatement performed?

MedicationRequest.substitution.allowed
type: ObjectProperty
comment: True if the prescriber allows a different drug to be dispensed from what was prescribed.
domain: MedicationRequestSubstitutionComponent
range: boolean
title: Whether substitution is allowed or not

VerificationResult.validator.organization
type: ObjectProperty
comment: Reference to the organization validating information.
domain: VerificationResultValidatorComponent
range: Reference
title: Reference to the organization validating information

Measure.group.stratifier.code
type: ObjectProperty
comment: Indicates a meaning for the stratifier. This can be as simple as a unique identifier, or it can establish meaning in a broader context by drawing from a terminology, allowing stratifiers to be correlated across measures.
domain: MeasureGroupComponent.MeasureGroupStratifierComponent
range: CodeableConcept
title: Meaning of the stratifier

MedicinalProductIngredient.substance.strength.measurementPoint
type: ObjectProperty
comment: For when strength is measured at a particular point or distance.
domain: MedicinalProductIngredientSubstanceComponentStrength
range: string
title: For when strength is measured at a particular point or distance

HealthcareService.identifier
type: ObjectProperty
comment: External identifiers for this item.
domain: HealthcareService
range: Identifier
sub property of: id
title: External identifiers for this item

Measure.purpose
type: ObjectProperty
comment: Explanation of why this measure is needed and why it has been designed as it has.
domain: Measure
range: markdown
sub property of: why
title: Why this measure is defined

StructureMap.group.rule.rule.target.element
type: ObjectProperty
comment: Field to create in the context.
domain: StructureMapGroupComponent.StructureMapGroupRuleComponentRule.StructureMapGroupRuleTargetComponent
range: string
title: Field to create in the context

Observation.valueQuantity
type: ObjectProperty
domain: Observation
range: Quantity
sub property of: Observation.value

MedicationKnowledge.contraindication
type: ObjectProperty
comment: Potential clinical issue with or between medication(s) (for example, drug-drug interaction, drug-disease contraindication, drug-allergy interaction, etc).
domain: MedicationKnowledge
range: Reference
title: Potential clinical issue with or between medication(s)

MedicinalProductClinicals.therapeuticIndication.duration
type: ObjectProperty
comment: Timing or duration information as part of the indication.
domain: MedicinalProductClinicalsTherapeuticIndicationComponent
range: Quantity
title: Timing or duration information as part of the indication

Patient.communication
type: ObjectProperty
comment: A language which may be used to communicate with the patient about his or her health.
domain: Patient
range: PatientCommunicationComponent
title: A language which may be used to communicate with the patient about his or her health

Endpoint.payloadMimeType
type: ObjectProperty
comment: The mime type to send the payload in - e.g. application/fhir+xml, application/fhir+json. If the mime type is not specified, then the sender could send any content (including no content depending on the connectionType).
domain: Endpoint
range: code
title: Mimetype to send. If not specified, the content could be anything (including no payload, if the connectionType defined this)

CapabilityStatement.imports
type: ObjectProperty
comment: Reference to a canonical URL of another CapabilityStatement that this software adds to. The capability statement automatically includes everything in the other statement, and it is not duplicated, though the server may repeat the same resources, interactions and operations to add additional details to them.
domain: CapabilityStatement
range: canonical
title: Canonical URL of another capability statement this adds to

EntryDefinition.status
type: ObjectProperty
comment: Used to support catalog exchange even for unsupported products, e.g. getting list of medications even if not prescribable.
domain: EntryDefinition
range: code
title: draft | active | retired | unknown

ContactDetail.name
type: ObjectProperty
comment: The name of an individual to contact.
domain: ContactDetail
range: string
title: Name of an individual to contact

Linkage.item.type
type: ObjectProperty
comment: Distinguishes which item is "source of truth" (if any) and which items are no longer considered to be current representations.
domain: LinkageItemComponent
range: code
title: source | alternate | historical

QuestionnaireResponse.item.answer.item.answer.valueString
type: ObjectProperty
domain: QuestionnaireResponseItemComponent.QuestionnaireResponseItemAnswerComponentItem.QuestionnaireResponseItemAnswerComponent
range: string
sub property of: QuestionnaireResponse.item.answer.item.answer.value

PractitionerRole.endpoint
type: ObjectProperty
comment: Technical endpoints providing access to services operated for the practitioner with this role.
domain: PractitionerRole
range: Reference
title: Technical endpoints providing access to services operated for the practitioner with this role

Task.requester
type: ObjectProperty
comment: The creator of the task.
domain: Task
range: Reference
sub property of: who.author
title: Who is asking for task to be done

Questionnaire.item.item.enableWhen.answerDecimal
type: ObjectProperty
domain: QuestionnaireItemComponentItem.QuestionnaireItemEnableWhenComponent
range: decimal
sub property of: Questionnaire.item.item.enableWhen.answer

MedicinalProductClinicals.undesirableEffects.population.gender
type: ObjectProperty
comment: The gender of the specific population.
domain: MedicinalProductClinicalsUndesirableEffectsComponent.MedicinalProductClinicalsUndesirableEffectsPopulationComponent
range: CodeableConcept
title: The gender of the specific population

Claim.item.servicedPeriod
type: ObjectProperty
domain: Claim.ItemComponent
range: Period
sub property of: Claim.item.serviced

Media.content
type: ObjectProperty
comment: The actual content of the media - inline or by direct reference to the media source file.
domain: Media
range: Attachment
title: Actual Media - reference or data

Questionnaire.url
type: ObjectProperty
comment: An absolute URI that is used to identify this questionnaire when it is referenced in a specification, model, design or an instance; also called its canonical identifier. This SHOULD be globally unique and SHOULD be a literal address at which at which an authoritative instance of this questionnaire is (or will be) published. This URL can be the target of a canonical reference. It SHALL remain the same when the questionnaire is stored on different servers.
domain: Questionnaire
range: uri
sub property of: id
title: Canonical identifier for this questionnaire, represented as a URI (globally unique)

Observation.specimen
type: ObjectProperty
comment: The specimen that was used when this observation was made.
domain: Observation
range: Reference
title: Specimen used for this observation

Location.operationalStatus
type: ObjectProperty
comment: The Operational status covers operation values most relevant to beds (but can also apply to rooms/units/chair/etc. such as an isolation unit/dialysis chair). This typically covers concepts such as contamination, housekeeping and other activities like maintenance.
domain: Location
range: Coding
sub property of: status
title: The Operational status of the location (typically only for a bed/room)

DeviceDefinition.type
type: ObjectProperty
comment: What kind of device or device system this is.
domain: DeviceDefinition
range: CodeableConcept
title: What kind of device or device system this is

AuditEvent.purposeOfEvent
type: ObjectProperty
comment: The purposeOfUse (reason) that was used during the event being recorded.
domain: AuditEvent
range: CodeableConcept
sub property of: why
title: The purposeOfUse of the event

ElementDefinition.slicing.discriminator.path
type: ObjectProperty
comment: A FHIRPath expression, using [the simple subset of FHIRPath](fhirpath.html#simple), that is used to identify the element on which discrimination is based.
domain: ElementDefinitionSlicingComponent.ElementDefinitionSlicingDiscriminatorComponent
range: string
title: Path to element value

ExplanationOfBenefit.processNote.language
type: ObjectProperty
comment: The ISO-639-1 alpha 2 code in lower case for the language, optionally followed by a hyphen and the ISO-3166-1 alpha 2 code for the region in upper case; e.g. "en" for English, or "en-US" for American English versus "en-EN" for England English.
domain: ExplanationOfBenefit.NoteComponent
range: CodeableConcept
title: Language if different from the resource

TestScript.date
type: ObjectProperty
comment: The date (and optionally time) when the test script was published. The date must change when the business version changes and it must change if the status code changes. In addition, it should change when the substantive content of the test script changes.
domain: TestScript
range: dateTime
sub property of: when.recorded
title: Date last changed

Contract.term.group.action.intent
type: ObjectProperty
comment: Reason or purpose for the action stipulated by this Contract Provision.
domain: Contract.TermComponentTerm.ActionComponent
range: CodeableConcept
sub property of: why
title: Purpose for the Contract Term Action

ServiceRequest.reasonReference
type: ObjectProperty
comment: Indicates another resource that provides a justification for why this service is being requested. May relate to the resources referred to in supportingInformation.
domain: ServiceRequest
range: Reference
sub property of: why
title: Explanation/Justification for service or service

ValueSetExpansionComponent
type: Class
comment: A value set can also be "expanded", where the value set is turned into a simple collection of enumerated codes. This element holds the expansion, if it has been performed.
subclass of: BackboneElement
subclass of: Restriction
  all values from: integer
  max cardinality: 1
  on property: ValueSet.expansion.offset
subclass of: Restriction
  all values from: uri
  max cardinality: 1
  on property: ValueSet.expansion.identifier
subclass of: Restriction
  all values from: integer
  max cardinality: 1
  on property: ValueSet.expansion.total
subclass of: Restriction
  cardinality: 1
  on property: ValueSet.expansion.timestamp
  some values from: dateTime
subclass of: Restriction
  all values from: ValueSetExpansionComponent.ValueSetExpansionContainsComponent
  on property: ValueSet.expansion.contains
subclass of: Restriction
  all values from: ValueSetExpansionComponent.ValueSetExpansionParameterComponent
  on property: ValueSet.expansion.parameter

SupplyDelivery.occurrenceDateTime
type: ObjectProperty
domain: SupplyDelivery
range: dateTime
sub property of: SupplyDelivery.occurrence

HealthcareService.comment
type: ObjectProperty
comment: Any additional description of the service and/or any specific issues not covered by the other attributes, which can be displayed as further detail under the serviceName.
domain: HealthcareService
range: string
title: Additional description and/or any specific issues not covered elsewhere

Bundle.entry
type: ObjectProperty
comment: An entry in a bundle resource - will either contain a resource or information about a resource (transactions and history only).
domain: Bundle
range: BundleEntryComponent
title: Entry in the bundle - will have a resource or information

ExampleScenario.process.description
type: ObjectProperty
comment: A longer description of the group of operations.
domain: ExampleScenarioProcessComponent
range: markdown
title: A longer description of the group of operations

NamingSystem.uniqueId.type
type: ObjectProperty
comment: Identifies the unique identifier scheme used for this particular identifier.
domain: NamingSystemUniqueIdComponent
range: code
title: oid | uuid | uri | other

Media.basedOn
type: ObjectProperty
comment: A procedure that is fulfilled in whole or in part by the creation of this media.
domain: Media
range: Reference
title: Procedure that caused this media to be created

CapabilityStatementMessagingComponent
type: Class
comment: A description of the messaging capabilities of the solution.
subclass of: BackboneElement
subclass of: Restriction
  all values from: CapabilityStatementMessagingComponent.CapabilityStatementMessagingSupportedMessageComponent
  on property: CapabilityStatement.messaging.supportedMessage
subclass of: Restriction
  all values from: markdown
  max cardinality: 1
  on property: CapabilityStatement.messaging.documentation
subclass of: Restriction
  all values from: unsignedInt
  max cardinality: 1
  on property: CapabilityStatement.messaging.reliableCache
subclass of: Restriction
  all values from: CapabilityStatementMessagingComponent.CapabilityStatementMessagingEndpointComponent
  on property: CapabilityStatement.messaging.endpoint

MedicationRequest.substitution.reason
type: ObjectProperty
comment: Indicates the reason for the substitution, or why substitution must or must not be performed.
domain: MedicationRequestSubstitutionComponent
range: CodeableConcept
title: Why should (not) substitution be made

ResearchStudyObjectiveComponent
type: Class
comment: A goal that the study is aiming to achieve in terms of a scientific question to be answered by the analysis of data collected during the study.
subclass of: BackboneElement
subclass of: Restriction
  all values from: CodeableConcept
  max cardinality: 1
  on property: ResearchStudy.objective.type
subclass of: Restriction
  all values from: string
  max cardinality: 1
  on property: ResearchStudy.objective.name

Sequence.identifier
type: ObjectProperty
comment: A unique identifier for this particular sequence instance. This is a FHIR-defined id.
domain: Sequence
range: Identifier
sub property of: id
title: Unique ID for this particular sequence. This is a FHIR-defined id

Signature.targetFormat
type: ObjectProperty
comment: A mime type that indicates the technical format of the target resources signed by the signature.
domain: Signature
range: code
title: The technical format of the signed resources

UserSession.expires
type: ObjectProperty
comment: Indicates the timestamp when the user session will expire (i.e. no longer be valid).
domain: UserSession
range: instant
title: When does the session expire

MedicationIngredientComponent
type: Class
comment: Identifies a particular constituent of interest in the product.
subclass of: BackboneElement
subclass of: Restriction
  all values from: Ratio
  max cardinality: 1
  on property: Medication.ingredient.amount
subclass of: Restriction
  all values from: boolean
  max cardinality: 1
  on property: Medication.ingredient.isActive
subclass of:
  union of: Restriction
    cardinality: 1
    on property: Medication.ingredient.itemCodeableConcept
    some values from: CodeableConcept
  union of: Restriction
    cardinality: 1
    on property: Medication.ingredient.itemReference
    some values from: Reference

ExampleScenario.process
type: ObjectProperty
comment: Each major process - a group of operations.
domain: ExampleScenario
range: ExampleScenarioProcessComponent
title: Each major process - a group of operations

SubstanceSpecification.substanceName.officialName.status
type: ObjectProperty
comment: The status of the official name.
domain: SubstanceSpecificationSubstanceNameComponent.SubstanceSpecificationSubstanceNameOfficialNameComponent
range: CodeableConcept
title: The status of the official name

SubstanceSpecification.identifier
type: ObjectProperty
comment: Identifier by which this substance is known.
domain: SubstanceSpecification
range: Identifier
title: Identifier by which this substance is known

DeviceDefinition.udiDeviceIdentifier.deviceIdentifier
type: ObjectProperty
comment: The identifier that is to be associated with every Device that references this DeviceDefintiion for the issuer and jurisdication porvided in the DeviceDefinition.udiDeviceIdentifier.
domain: DeviceDefinitionUdiDeviceIdentifierComponent
range: string
title: The identifier that is to be associated with every Device that references this DeviceDefintiion for the issuer and jurisdication porvided in the DeviceDefinition.udiDeviceIdentifier

Consent.policy.uri
type: ObjectProperty
comment: The references to the policies that are included in this consent scope. Policies may be organizational, but are often defined jurisdictionally, or in law.
domain: ConsentPolicyComponent
range: uri
title: Specific policy covered by this consent

ChargeItemDefinition.lastReviewDate
type: ObjectProperty
comment: The date on which the resource content was last reviewed. Review happens periodically after approval but does not change the original approval date.
domain: ChargeItemDefinition
range: date
title: When the charge item definition was last reviewed

NutritionOrder.oralDiet.type
type: ObjectProperty
comment: The kind of diet or dietary restriction such as fiber restricted diet or diabetic diet.
domain: NutritionOrderOralDietComponent
range: CodeableConcept
sub property of: what
title: Type of oral diet or diet restrictions that describe what can be consumed orally

CommunicationRequest.occurrencePeriod
type: ObjectProperty
domain: CommunicationRequest
range: Period
sub property of: CommunicationRequest.occurrence

MedicinalProductPackaged.packageItem.manufacturer
type: ObjectProperty
comment: Manufacturer of this Package Item.
domain: MedicinalProductPackagedPackageItemComponent
range: Reference
title: Manufacturer of this Package Item

QuestionnaireResponseItemComponentItemItem
type: Class
comment: Questions or sub-groups nested beneath a question or group.
subclass of: BackboneElement
title: Nested questionnaire response items

MedicinalProductPackaged.packageItem.quantity
type: ObjectProperty
comment: The quantity of this package in the medicinal product, at the current level of packaging. The outermost is always 1.
domain: MedicinalProductPackagedPackageItemComponent
range: Quantity
title: The quantity of this package in the medicinal product, at the current level of packaging. The outermost is always 1

Questionnaire.item.answerOption
type: ObjectProperty
comment: One of the permitted answers for a "choice" or "open-choice" question.
domain: QuestionnaireItemComponent
range: QuestionnaireItemComponent.QuestionnaireItemAnswerOptionComponent
title: Permitted answer

Consent.provision.provision
type: ObjectProperty
comment: Rules which provide exceptions to the base rule or subrules.
domain: Consent.provisionComponent
range: Consent.provisionComponentProvision
title: Nested Exception Rules

MedicinalProductNameComponent
type: Class
comment: The product's name, including full name and possibly coded parts.
subclass of: BackboneElement
subclass of: Restriction
  all values from: MedicinalProductNameComponent.MedicinalProductNameCountryLanguageComponent
  on property: MedicinalProduct.name.countryLanguage
subclass of: Restriction
  all values from: MedicinalProductNameComponent.MedicinalProductNameNamePartComponent
  on property: MedicinalProduct.name.namePart
subclass of: Restriction
  cardinality: 1
  on property: MedicinalProduct.name.productName
  some values from: string

ConceptMap.group.unmapped.display
type: ObjectProperty
comment: The display for the code. The display is only provided to help editors when editing the concept map.
domain: ConceptMapGroupComponent.ConceptMapGroupUnmappedComponent
range: string
title: Display for the code

TestScript.teardown.action.operation.params
type: ObjectProperty
comment: Path plus parameters after [type]. Used to set parts of the request URL explicitly.
domain: TestScriptTeardownComponent.TeardownActionComponentOperation
range: string
title: Explicitly defined path parameters

ClaimResponse.item.detail.adjudication.reason
type: ObjectProperty
comment: Adjudication reason such as limit reached.
domain: ClaimResponse.ItemComponent.ItemDetailComponentAdjudication
range: CodeableConcept
title: Explanation of Adjudication outcome

VisionPrescription.dispense
type: ObjectProperty
comment: Deals with details of the dispense part of the supply specification.
domain: VisionPrescription
range: VisionPrescriptionDispenseComponent
title: Vision supply authorization

ExplanationOfBenefit.BenefitBalanceComponent
type: Class
comment: Balance by Benefit Category.
subclass of: BackboneElement
subclass of: Restriction
  cardinality: 1
  on property: ExplanationOfBenefit.benefitBalance.category
  some values from: CodeableConcept
subclass of: Restriction
  all values from: CodeableConcept
  max cardinality: 1
  on property: ExplanationOfBenefit.benefitBalance.term
subclass of: Restriction
  all values from: string
  max cardinality: 1
  on property: ExplanationOfBenefit.benefitBalance.description
subclass of: Restriction
  all values from: boolean
  max cardinality: 1
  on property: ExplanationOfBenefit.benefitBalance.excluded
subclass of: Restriction
  all values from: CodeableConcept
  max cardinality: 1
  on property: ExplanationOfBenefit.benefitBalance.network
subclass of: Restriction
  all values from: string
  max cardinality: 1
  on property: ExplanationOfBenefit.benefitBalance.name
subclass of: Restriction
  all values from: ExplanationOfBenefit.BenefitBalanceComponent.BenefitComponent
  on property: ExplanationOfBenefit.benefitBalance.financial
subclass of: Restriction
  all values from: CodeableConcept
  max cardinality: 1
  on property: ExplanationOfBenefit.benefitBalance.unit

ProcessRequest.include
type: ObjectProperty
comment: Names of resource types to include.
domain: ProcessRequest
range: string
title: Resource type(s) to include

Composition.attester.mode
type: ObjectProperty
comment: The type of attestation the authenticator offers.
domain: CompositionAttesterComponent
range: code
title: personal | professional | legal | official

RequestGroup.action.action.textEquivalent
type: ObjectProperty
comment: A text equivalent of the action to be performed. This provides a human-interpretable description of the action when the definition is consumed by a system that might not be capable of interpreting it dynamically.
domain: RequestGroupActionComponentAction
range: string
title: Static text equivalent of the action, used if the dynamic aspects cannot be interpreted by the receiving system

ObservationComponentComponentReferenceRange
type: Class
comment: Guidance on how to interpret the value by comparison to a normal or recommended range.
subclass of: BackboneElement
subclass of: Restriction
  all values from: CodeableConcept
  max cardinality: 1
  on property: Observation.component.referenceRange.type
subclass of: Restriction
  all values from: string
  max cardinality: 1
  on property: Observation.component.referenceRange.text
subclass of: Restriction
  all values from: Range
  max cardinality: 1
  on property: Observation.component.referenceRange.age
subclass of: Restriction
  all values from: SimpleQuantity
  max cardinality: 1
  on property: Observation.component.referenceRange.high
subclass of: Restriction
  all values from: CodeableConcept
  on property: Observation.component.referenceRange.appliesTo
subclass of: Restriction
  all values from: SimpleQuantity
  max cardinality: 1
  on property: Observation.component.referenceRange.low
title: Provides guide for interpretation of component result

Goal.priority
type: ObjectProperty
comment: Identifies the mutually agreed level of importance associated with reaching/sustaining the goal.
domain: Goal
range: CodeableConcept
sub property of: grade
title: high-priority | medium-priority | low-priority

Resource
type: Class
comment: This is the base resource type for everything.
subclass of: Thing
subclass of: Restriction
  all values from: code
  max cardinality: 1
  on property: Resource.language
subclass of: Restriction
  all values from: uri
  max cardinality: 1
  on property: Resource.implicitRules
subclass of: Restriction
  all values from: Meta
  max cardinality: 1
  on property: Resource.meta
subclass of: Restriction
  all values from: id
  max cardinality: 1
  on property: Resource.id
subclass of: Restriction
  all values from: treeRoot
  max cardinality: 1
  on property: nodeRole

RequestGroup.action.action.timingPeriod
type: ObjectProperty
domain: RequestGroupActionComponentAction
range: Period
sub property of: RequestGroup.action.action.timing

MedicationKnowledge.monograph.type
type: ObjectProperty
comment: The category of documentation about the medication. (e.g. professional monograph, patient educaton monograph).
domain: MedicationKnowledgeMonographComponent
range: CodeableConcept
title: The category of medication document

Contract.term.group.asset.period
type: ObjectProperty
comment: Asset relevant contractual time period.
domain: Contract.TermComponentTerm.ContractAssetComponent
range: Period
title: Time period of the asset

ExampleScenario.process.step.alternative.option.step.process.step.operation.type
type: ObjectProperty
comment: The type of operation - CRUD.
domain: ExampleScenarioProcessComponent.ExampleScenarioProcessStepComponent.ExampleScenarioProcessStepAlternativeComponent.ExampleScenarioProcessStepAlternativeOptionComponentStepProcess.ExampleScenarioProcessStepComponent.ExampleScenarioProcessStepOperationComponent
range: string
title: The type of operation - CRUD

Questionnaire.item.answerOption.value
type: ObjectProperty

Appointment.created
type: ObjectProperty
comment: The date that this appointment was initially created. This could be different to the meta.lastModified value on the initial entry, as this could have been before the resource was created on the FHIR server, and should remain unchanged over the lifespan of the appointment.
domain: Appointment
range: dateTime
title: The date that this appointment was initially created

FamilyMemberHistory.status
type: ObjectProperty
comment: A code specifying the status of the record of the family history of a specific family member.
domain: FamilyMemberHistory
range: code
sub property of: status
title: partial | completed | entered-in-error | health-unknown

Immunization.protocolApplied.series
type: ObjectProperty
comment: One possible path to achieve presumed immunity against a disease - within the context of an authority.
domain: ImmunizationProtocolAppliedComponent
range: string
title: Name of vaccine series

SubstanceSpecification.moiety.identifier
type: ObjectProperty
comment: Identifier by which this moiety substance is known.
domain: SubstanceSpecificationMoietyComponent
range: Identifier
title: Identifier by which this moiety substance is known

CarePlan.activity.detail.productReference
type: ObjectProperty
domain: CarePlanActivityComponent.CarePlanActivityDetailComponent
range: Reference
sub property of: CarePlan.activity.detail.product

Composition.section.section.section
type: ObjectProperty
comment: A nested sub-section within this section.
domain: Composition.SectionComponentSection
range: Composition.SectionComponentSectionSection
title: Nested Section

SubstanceSpecification.molecularWeight
type: ObjectProperty
comment: The molecular weight or weight range (for proteins, polymers or nucleic acids).
domain: SubstanceSpecification
range: SubstanceSpecificationMolecularWeight
title: The molecular weight or weight range (for proteins, polymers or nucleic acids)

TestScript.rule.param
type: ObjectProperty
comment: Each rule template can take one or more parameters for rule evaluation.
domain: TestScriptRuleComponent
range: TestScriptRuleComponent.RuleParamComponent
title: Rule parameter template

Goal.target.detailRange
type: ObjectProperty
domain: GoalTargetComponent
range: Range
sub property of: Goal.target.detail

ResearchStudy
type: Class
comment: A process where a researcher or organization plans and then executes a series of steps intended to increase the field of healthcare-related knowledge. This includes studies of safety, efficacy, comparative effectiveness and other information about medications, devices, therapies and other interventional and investigative techniques. A ResearchStudy involves the gathering of information about human or animal subjects.
subclass of: DomainResource
subclass of: clinical.diagnostics
subclass of: Restriction
  all values from: Reference
  max cardinality: 1
  on property: ResearchStudy.principalInvestigator
subclass of: Restriction
  all values from: CodeableConcept
  on property: ResearchStudy.keyword
subclass of: Restriction
  all values from: ResearchStudyArmComponent
  on property: ResearchStudy.arm
subclass of: Restriction
  all values from: CodeableConcept
  max cardinality: 1
  on property: ResearchStudy.reasonStopped
subclass of: Restriction
  all values from: ContactDetail
  on property: ResearchStudy.contact
subclass of: Restriction
  all values from: Reference
  on property: ResearchStudy.site
subclass of: Restriction
  all values from: CodeableConcept
  on property: ResearchStudy.condition
subclass of: Restriction
  all values from: RelatedArtifact
  on property: ResearchStudy.relatedArtifact
subclass of: Restriction
  all values from: CodeableConcept
  on property: ResearchStudy.focus
subclass of: Restriction
  all values from: Reference
  max cardinality: 1
  on property: ResearchStudy.sponsor
subclass of: Restriction
  all values from: CodeableConcept
  max cardinality: 1
  on property: ResearchStudy.phase
subclass of: Restriction
  all values from: Period
  max cardinality: 1
  on property: ResearchStudy.period
subclass of: Restriction
  all values from: Reference
  on property: ResearchStudy.enrollment
subclass of: Restriction
  all values from: CodeableConcept
  max cardinality: 1
  on property: ResearchStudy.primaryPurposeType
subclass of: Restriction
  all values from: markdown
  max cardinality: 1
  on property: ResearchStudy.description
subclass of: Restriction
  all values from: string
  max cardinality: 1
  on property: ResearchStudy.title
subclass of: Restriction
  all values from: Identifier
  on property: ResearchStudy.identifier
subclass of: Restriction
  cardinality: 1
  on property: ResearchStudy.status
  some values from: code
subclass of: Restriction
  all values from: Reference
  on property: ResearchStudy.partOf
subclass of: Restriction
  all values from: Reference
  on property: ResearchStudy.protocol
subclass of: Restriction
  all values from: ResearchStudyObjectiveComponent
  on property: ResearchStudy.objective
subclass of: Restriction
  all values from: CodeableConcept
  on property: ResearchStudy.location
subclass of: Restriction
  all values from: CodeableConcept
  on property: ResearchStudy.category
subclass of: Restriction
  all values from: Annotation
  on property: ResearchStudy.note

MedicinalProductAuthorization.regulator
type: ObjectProperty
comment: Medicines Regulatory Agency.
domain: MedicinalProductAuthorization
range: Reference
title: Medicines Regulatory Agency

Contract.term.identifier
type: ObjectProperty
comment: Unique identifier for this particular Contract Provision.
domain: Contract.TermComponent
range: Identifier
title: Contract Term Number

ConceptMap.group.unmapped.mode
type: ObjectProperty
comment: Defines which action to take if there is no match for the source concept in the target system designated for the group. One of 3 actions are possible: use the unmapped code (this is useful when doing a mapping between versions, and only a few codes have changed), use a fixed code (a default code), or alternatively, a reference to a different concept map can be provided (by canonical URL).
domain: ConceptMapGroupComponent.ConceptMapGroupUnmappedComponent
range: code
title: provided | fixed | other-map

GraphDefinition.status
type: ObjectProperty
comment: The status of this graph definition. Enables tracking the life-cycle of the content.
domain: GraphDefinition
range: code
sub property of: status
title: draft | active | retired | unknown

Duration
type: Class
comment: A length of time.
subclass of: Quantity
title: A length of time

DocumentReference.status
type: ObjectProperty
comment: The status of this document reference.
domain: DocumentReference
range: code
sub property of: status
title: current | superseded | entered-in-error

TestScriptRuleComponent
type: Class
comment: Assert rule to be used in one or more asserts within the test script.
subclass of: BackboneElement
subclass of: Restriction
  all values from: TestScriptRuleComponent.RuleParamComponent
  on property: TestScript.rule.param
subclass of: Restriction
  cardinality: 1
  on property: TestScript.rule.resource
  some values from: Reference

MedicationRequest.performer
type: ObjectProperty
comment: The specified desired performer of the medication treatment (e.g. the performer of the medication administration).
domain: MedicationRequest
range: Reference
sub property of: who.actor
title: Intended performer of administration

ExplanationOfBenefit.item.detail.subDetail.modifier
type: ObjectProperty
comment: Item typification or modifiers codes, e.g. for Oral whether the treatment is cosmetic or associated with TMJ, or for medical whether the treatment was outside the clinic or out of office hours.
domain: ExplanationOfBenefit.ItemComponent.DetailComponent.SubDetailComponent
range: CodeableConcept
title: Service/Product billing modifiers

PlanDefinition.action.goalId
type: ObjectProperty
comment: Identifies goals that this action supports. The reference must be to a goal element defined within this plan definition.
domain: PlanDefinitionActionComponent
range: id
title: What goals this action supports

Condition.severity
type: ObjectProperty
comment: A subjective assessment of the severity of the condition as evaluated by the clinician.
domain: Condition
range: CodeableConcept
sub property of: grade
title: Subjective severity of condition

ActivityDefinition.doNotPerform
type: ObjectProperty
comment: Set this to true if the definition is to indicate that a particular activity should NOT be performed. If true, this element should be interpreted to reinforce a negative coding. For example NPO as a code with a doNotPerform of true would still indicate to NOT perform the action.
domain: ActivityDefinition
range: boolean
title: True if the activity should not be performed

Address.state
type: ObjectProperty
comment: Sub-unit of a country with limited sovereignty in a federally organized country. A code may be used if codes are in common use (e.g. US 2 letter state codes).
domain: Address
range: string
title: Sub-unit of country (abbreviations ok)

MessageDefinition.contact
type: ObjectProperty
comment: Contact details to assist a user in finding and communicating with the publisher.
domain: MessageDefinition
range: ContactDetail
title: Contact details for the publisher

ActivityDefinition.productReference
type: ObjectProperty
domain: ActivityDefinition
range: Reference
sub property of: ActivityDefinition.product

ExplanationOfBenefit.addItem.detail.subDetail.adjudication
type: ObjectProperty
comment: The adjudication results.
domain: ExplanationOfBenefit.AddedItemComponent.AddedItemDetailComponent.AddedItemDetailSubDetailComponent
range: ExplanationOfBenefit.AddedItemComponent.AddedItemDetailComponent.AddedItemDetailSubDetailComponentAdjudication
title: Added items adjudication

ObservationDefinition.quantitativeDetails.conversionFactor
type: ObjectProperty
comment: Factor for converting value expressed with SI unit to value expressed with customary unit.
domain: ObservationDefinitionQuantitativeDetailsComponent
range: decimal
title: SI to Customary unit conversion factor

TestScriptMetadataComponent.TestScriptMetadataLinkComponent
type: Class
comment: A link to the FHIR specification that this test is covering.
subclass of: BackboneElement
subclass of: Restriction
  all values from: string
  max cardinality: 1
  on property: TestScript.metadata.link.description
subclass of: Restriction
  cardinality: 1
  on property: TestScript.metadata.link.url
  some values from: uri

Contract.TermComponent.ContractAssetComponent.ValuedItemComponent
type: Class
comment: Contract Valued Item List.
subclass of: BackboneElement
subclass of: Restriction
  all values from: decimal
  max cardinality: 1
  on property: Contract.term.asset.valuedItem.points
subclass of: Restriction
  all values from: unsignedInt
  on property: Contract.term.asset.valuedItem.securityLabelNumber
subclass of: Restriction
  all values from: dateTime
  max cardinality: 1
  on property: Contract.term.asset.valuedItem.effectiveTime
subclass of: Restriction
  all values from: Reference
  max cardinality: 1
  on property: Contract.term.asset.valuedItem.recipient
subclass of: Restriction
  all values from: dateTime
  max cardinality: 1
  on property: Contract.term.asset.valuedItem.paymentDate
subclass of: Restriction
  all values from: Money
  max cardinality: 1
  on property: Contract.term.asset.valuedItem.net
subclass of: Restriction
  all values from: SimpleQuantity
  max cardinality: 1
  on property: Contract.term.asset.valuedItem.quantity
subclass of: Restriction
  all values from: Reference
  max cardinality: 1
  on property: Contract.term.asset.valuedItem.responsible
subclass of:
  union of: Restriction
    all values from: CodeableConcept
    max cardinality: 1
    on property: Contract.term.asset.valuedItem.entityCodeableConcept
  union of: Restriction
    all values from: Reference
    max cardinality: 1
    on property: Contract.term.asset.valuedItem.entityReference
subclass of: Restriction
  all values from: decimal
  max cardinality: 1
  on property: Contract.term.asset.valuedItem.factor
subclass of: Restriction
  all values from: string
  on property: Contract.term.asset.valuedItem.linkId
subclass of: Restriction
  all values from: string
  max cardinality: 1
  on property: Contract.term.asset.valuedItem.payment
subclass of: Restriction
  all values from: Identifier
  max cardinality: 1
  on property: Contract.term.asset.valuedItem.identifier
subclass of: Restriction
  all values from: Money
  max cardinality: 1
  on property: Contract.term.asset.valuedItem.unitPrice

ChargeItemDefinition.propertyGroup.priceComponent
type: ObjectProperty
comment: The price for a ChargeItem may be calculated as a base price with surcharges/deductions that apply in certain conditions. A ChargeItemDefinition resource that defines the prices, factors and conditions that apply to a billing code is currently under developement. The priceComponent element can be used to offer transparency to the recipient of the Invoice of how the prices have been calculated.
domain: ChargeItemDefinitionPropertyGroupComponent
range: ChargeItemDefinitionPropertyGroupComponent.ChargeItemDefinitionPropertyGroupPriceComponentComponent
title: Components of total line item price

MedicinalProductClinicals.therapeuticIndication.otherTherapy.medication
type: ObjectProperty

DataRequirement.subjectCodeableConcept
type: ObjectProperty
domain: DataRequirement
range: CodeableConcept
sub property of: DataRequirement.subject

Device.property
type: ObjectProperty
comment: The actual configuration settings of a device as it actually operates, e.g., regulation status, time properties.
domain: Device
range: DevicePropertyComponent
title: The actual configuration settings of a device as it actually operates, e.g., regulation status, time properties

ResearchStudy.arm.description
type: ObjectProperty
comment: A succinct description of the path through the study that would be followed by a subject adhering to this arm.
domain: ResearchStudyArmComponent
range: string
title: Short explanation of study path

ActivityDefinition.product
type: ObjectProperty

MedicinalProduct.name.productName
type: ObjectProperty
comment: The full product name.
domain: MedicinalProductNameComponent
range: string
title: The full product name

VisionPrescription.dispense.power
type: ObjectProperty
comment: Contact lens power measured in dioptres (0.25 units).
domain: VisionPrescriptionDispenseComponent
range: decimal
title: Contact lens power

Coverage.relationship
type: ObjectProperty
comment: The relationship of beneficiary (patient) to the subscriber.
domain: Coverage
range: CodeableConcept
title: Beneficiary relationship to the Subscriber

Procedure.reasonCode
type: ObjectProperty
comment: The coded reason why the procedure was performed. This may be coded entity of some type, or may simply be present as text.
domain: Procedure
range: CodeableConcept
sub property of: why
title: Coded reason procedure performed

MedicinalProductClinicals.contraindication.population.physiologicalCondition
type: ObjectProperty
comment: The existing physiological conditions of the specific population to which this applies.
domain: MedicinalProductClinicalsContraindicationComponentPopulation
range: CodeableConcept
title: The existing physiological conditions of the specific population to which this applies

MedicinalProductPharmaceutical.routeOfAdministration.targetSpecies.code
type: ObjectProperty
comment: Coded expression for the species.
domain: MedicinalProductPharmaceuticalRouteOfAdministrationComponent.MedicinalProductPharmaceuticalRouteOfAdministrationTargetSpeciesComponent
range: CodeableConcept
title: Coded expression for the species

ElementDefinition.base
type: ObjectProperty
comment: Information about the base definition of the element, provided to make it unnecessary for tools to trace the deviation of the element through the derived and related profiles. When the element definition is not the original definition of an element - i.g. either in a constraint on another type, or for elements from a super type in a snap shot - then the information in provided in the element definition may be different to the base definition. On the original definition of the element, it will be same.
domain: ElementDefinition
range: ElementDefinitionBaseComponent
title: Base definition information for tools

Bundle.entry.response.status
type: ObjectProperty
comment: The status code returned by processing this entry. The status SHALL start with a 3 digit HTTP code (e.g. 404) and may contain the standard HTTP description associated with the status code.
domain: BundleEntryComponent.BundleEntryResponseComponent
range: string
title: Status response code (text optional)

ProcessResponse.processNote.text
type: ObjectProperty
comment: The note text.
domain: ProcessResponseProcessNoteComponent
range: string
title: Comment on the processing

QuestionnaireResponse.item.answer
type: ObjectProperty
comment: The respondent's answer(s) to the question.
domain: QuestionnaireResponseItemComponent
range: QuestionnaireResponseItemComponent.QuestionnaireResponseItemAnswerComponent
title: The response(s) to the question

MedicinalProduct.name.namePart.part
type: ObjectProperty
comment: A fragment of a product name.
domain: MedicinalProductNameComponent.MedicinalProductNameNamePartComponent
range: string
title: A fragment of a product name

Contract.term.group.action.performerLinkId
type: ObjectProperty
comment: Id [identifier??] of the clause or question text related to the reason type or reference of this action in the referenced form or QuestionnaireResponse.
domain: Contract.TermComponentTerm.ActionComponent
range: string
title: Pointer to specific item

MedicinalProductPharmaceutical.ingredient
type: ObjectProperty
comment: Ingredient.
domain: MedicinalProductPharmaceutical
range: Reference
title: Ingredient

TestScript.teardown.action.operation.origin
type: ObjectProperty
comment: The server where the request message originates from. Must be one of the server numbers listed in TestScript.origin section.
domain: TestScriptTeardownComponent.TeardownActionComponentOperation
range: integer
title: Server initiating the request

MedicinalProductClinicals.therapeuticIndication.population
type: ObjectProperty
comment: The population group to which this applies.
domain: MedicinalProductClinicalsTherapeuticIndicationComponent
range: MedicinalProductClinicalsTherapeuticIndicationComponentPopulation
title: The population group to which this applies

Immunization.reasonCode
type: ObjectProperty
comment: Reasons why the vaccine was administered.
domain: Immunization
range: CodeableConcept
title: Why immunization occurred

ResearchStudyArmComponent
type: Class
comment: Describes an expected sequence of events for one of the participants of a study. E.g. Exposure to drug A, wash-out, exposure to drug B, wash-out, follow-up.
subclass of: BackboneElement
subclass of: Restriction
  all values from: string
  max cardinality: 1
  on property: ResearchStudy.arm.description
subclass of: Restriction
  all values from: CodeableConcept
  max cardinality: 1
  on property: ResearchStudy.arm.type
subclass of: Restriction
  cardinality: 1
  on property: ResearchStudy.arm.name
  some values from: string

ItemInstance.lotNumber
type: ObjectProperty
comment: The lot or batch number.
domain: ItemInstance
range: string
title: The lot or batch number

MedicinalProductIndication.population.race
type: ObjectProperty
comment: Race of the specific population.
domain: MedicinalProductIndicationPopulationComponent
range: CodeableConcept
title: Race of the specific population

NutritionOrder.intent
type: ObjectProperty
comment: Indicates the level of authority/intentionality associated with the NutrionOrder and where the request fits into the workflow chain.
domain: NutritionOrder
range: code
sub property of: class
title: proposal | plan | order

AllergyIntolerance.onsetAge
type: ObjectProperty
domain: AllergyIntolerance
range: Age
sub property of: AllergyIntolerance.onset

ImagingStudy.procedureCode
type: ObjectProperty
comment: The code for the performed procedure type.
domain: ImagingStudy
range: CodeableConcept
title: The performed procedure code

SpecimenDefinition.specimenToLab.containerAdditive.additive
type: ObjectProperty

ClinicalImpression.status
type: ObjectProperty
comment: Identifies the workflow status of the assessment.
domain: ClinicalImpression
range: code
sub property of: status
title: draft | completed | entered-in-error

ImplementationGuide.status
type: ObjectProperty
comment: The status of this implementation guide. Enables tracking the life-cycle of the content.
domain: ImplementationGuide
range: code
sub property of: status
title: draft | active | retired | unknown

RequestGroupActionComponent.RequestGroupActionConditionComponent
type: Class
comment: An expression that describes applicability criteria, or start/stop conditions for the action.
subclass of: BackboneElement
subclass of: Restriction
  all values from: string
  max cardinality: 1
  on property: RequestGroup.action.condition.expression
subclass of: Restriction
  all values from: string
  max cardinality: 1
  on property: RequestGroup.action.condition.language
subclass of: Restriction
  all values from: string
  max cardinality: 1
  on property: RequestGroup.action.condition.description
subclass of: Restriction
  cardinality: 1
  on property: RequestGroup.action.condition.kind
  some values from: code

InsurancePlan.coverage.benefit.limit.value
type: ObjectProperty
comment: The maximum amount of a service item a plan will pay for a covered benefit. For examples. wellness visits, or eyeglasses.
domain: InsurancePlanCoverageComponent.CoverageBenefitComponent.CoverageBenefitLimitComponent
range: Quantity
title: Maximum value allowed

SubstanceReferenceInformation.target.source
type: ObjectProperty
comment: Todo.
domain: SubstanceReferenceInformationTargetComponent
range: Reference
title: Todo

DocumentManifest.recipient
type: ObjectProperty
comment: A patient, practitioner, or organization for which this set of documents is intended.
domain: DocumentManifest
range: Reference
sub property of: who.cause
title: Intended to get notified about this set of documents

Contract.term.action.type
type: ObjectProperty
comment: Activity or service obligation to be done or not done, performed or not performed, effectuated or not by this Contract term.
domain: Contract.TermComponent.ActionComponent
range: CodeableConcept
title: Type or form of the action

CarePlan.activity.detail.goal
type: ObjectProperty
comment: Internal reference that identifies the goals that this activity is intended to contribute towards meeting.
domain: CarePlanActivityComponent.CarePlanActivityDetailComponent
range: Reference
title: Goals this activity relates to

Claim.item.unitPrice
type: ObjectProperty
comment: If the item is a node then this is the fee for the product or service, otherwise this is the total of the fees for the children of the group.
domain: Claim.ItemComponent
range: Money
title: Fee, charge or cost per point

ExampleScenario.process.step.process.step.alternative.option.step.operation
type: ObjectProperty
comment: Each interaction or action.
domain: ExampleScenarioProcessComponent.ExampleScenarioProcessStepComponentProcess.ExampleScenarioProcessStepComponent.ExampleScenarioProcessStepAlternativeComponent.ExampleScenarioProcessStepAlternativeOptionComponentStep
range: ExampleScenarioProcessComponent.ExampleScenarioProcessStepComponentProcess.ExampleScenarioProcessStepComponent.ExampleScenarioProcessStepAlternativeComponent.ExampleScenarioProcessStepAlternativeOptionComponentStep.ExampleScenarioProcessStepOperationComponent
title: Each interaction or action

ExplanationOfBenefit.procedure.sequence
type: ObjectProperty
comment: Sequence of procedures which serves to order and provide a link.
domain: ExplanationOfBenefit.ProcedureComponent
range: positiveInt
title: Procedure sequence for reference

MessageHeader.response.code
type: ObjectProperty
comment: Code that identifies the type of response to the message - whether it was successful or not, and whether it should be resent or not.
domain: MessageHeaderResponseComponent
range: code
title: ok | transient-error | fatal-error

MedicationDispense.detectedIssue
type: ObjectProperty
comment: Indicates an actual or potential clinical issue with or between one or more active or proposed clinical actions for a patient; e.g. drug-drug interaction, duplicate therapy, dosage alert etc.
domain: MedicationDispense
range: Reference
title: Clinical issue with action

Contract.signer
type: ObjectProperty
comment: Parties with legal standing in the Contract, including the principal parties, the grantor(s) and grantee(s), which are any person or organization bound by the contract, and any ancillary parties, which facilitate the execution of the contract such as a notary or witness.
domain: Contract
range: Contract.SignatoryComponent
title: Contract Signatory

ClaimResponse.outcome
type: ObjectProperty
comment: Transaction: error, complete, partial processing.
domain: ClaimResponse
range: code
title: queued | complete | error | partial

VerificationResult.primarySource.pushTypeAvailable
type: ObjectProperty
comment: Type of alerts/updates the primary source can send (specific requested changes; any changes; as defined by source).
domain: VerificationResultPrimarySourceComponent
range: CodeableConcept
title: specific | any | source

StructureMap.group.rule.rule
type: ObjectProperty
comment: Rules contained in this rule.
domain: StructureMapGroupComponent.StructureMapGroupRuleComponent
range: StructureMapGroupComponent.StructureMapGroupRuleComponentRule
title: Rules contained in this rule

CarePlan.activity.outcomeReference
type: ObjectProperty
comment: Details of the outcome or action resulting from the activity. The reference to an "event" resource, such as Procedure or Encounter or Observation, is the result/outcome of the activity itself. The activity can be conveyed using CarePlan.activity.detail OR using the CarePlan.activity.reference (a reference to a “request” resource).
domain: CarePlanActivityComponent
range: Reference
title: Appointment, Encounter, Procedure, etc.

MedicinalProductPharmaceutical.identifier
type: ObjectProperty
comment: An identifier for the pharmaceutical medicinal product.
domain: MedicinalProductPharmaceutical
range: Identifier
title: An identifier for the pharmaceutical medicinal product

DocumentReference.type
type: ObjectProperty
comment: Specifies the particular kind of document referenced (e.g. History and Physical, Discharge Summary, Progress Note). This usually equates to the purpose of making the document referenced.
domain: DocumentReference
range: CodeableConcept
sub property of: class
title: Kind of document (LOINC if possible)

Bundle.entry.request.url
type: ObjectProperty
comment: The URL for this entry, relative to the root (the address to which the request is posted).
domain: BundleEntryComponent.BundleEntryRequestComponent
range: uri
title: URL for HTTP equivalent of this entry

Bundle.entry.link
type: ObjectProperty
comment: A series of links that provide context to this entry.
domain: BundleEntryComponent
range: BundleEntryComponentLink
title: Links related to this entry

OrganizationAffiliation.telecom
type: ObjectProperty
comment: Contact details at the participatingOrganization relevant to this Affiliation.
domain: OrganizationAffiliation
range: ContactPoint
title: Contact details at the participatingOrganization relevant to this Affiliation

ImmunizationRecommendation.recommendation.doseNumberString
type: ObjectProperty
domain: ImmunizationRecommendationRecommendationComponent
range: string
sub property of: ImmunizationRecommendation.recommendation.doseNumber

DeviceRequest.identifier
type: ObjectProperty
comment: Identifiers assigned to this order by the orderer or by the receiver.
domain: DeviceRequest
range: Identifier
sub property of: id
title: External Request identifier

ExplanationOfBenefit.processNote.type
type: ObjectProperty
comment: The note purpose: Print/Display.
domain: ExplanationOfBenefit.NoteComponent
range: code
title: display | print | printoper

TriggerDefinition.timingDateTime
type: ObjectProperty
domain: TriggerDefinition
range: dateTime
sub property of: TriggerDefinition.timing

HealthcareService.availableTime.availableStartTime
type: ObjectProperty
comment: The opening time of day. Note: If the AllDay flag is set, then this time is ignored.
domain: HealthcareServiceAvailableTimeComponent
range: time
title: Opening time of day (ignored if allDay = true)

ValueSet.expansion.contains.designation.use
type: ObjectProperty
comment: A code that represents types of uses of designations.
domain: ValueSetExpansionComponent.ValueSetExpansionContainsComponentDesignation
range: Coding
title: Types of uses of designations

Sequence.structureVariant.inner.start
type: ObjectProperty
comment: Structural Variant Inner Start.If the coordinate system is either 0-based or 1-based, then start position is inclusive.
domain: SequenceStructureVariantComponent.SequenceStructureVariantInnerComponent
range: integer
title: Structural Variant Inner Start

Contract.term.action.subject.reference
type: ObjectProperty
comment: The entity the action is performed or not performed on or for.
domain: Contract.TermComponent.ActionComponent.ActionSubjectComponent
range: Reference
title: Entity of the action

MedicinalProductContraindication.population
type: ObjectProperty
comment: The population group to which this applies.
domain: MedicinalProductContraindication
range: MedicinalProductContraindicationPopulationComponent
title: The population group to which this applies

MedicinalProductClinicals.therapeuticIndication.population.physiologicalCondition
type: ObjectProperty
comment: The existing physiological conditions of the specific population to which this applies.
domain: MedicinalProductClinicalsTherapeuticIndicationComponentPopulation
range: CodeableConcept
title: The existing physiological conditions of the specific population to which this applies

ClaimResponse.processNote.text
type: ObjectProperty
comment: The note text.
domain: ClaimResponse.NoteComponent
range: string
title: Note explanatory text

ResearchStudy.site
type: ObjectProperty
comment: A facility in which study activities are conducted.
domain: ResearchStudy
range: Reference
sub property of: where
title: Facility where study activities are conducted

Timing.event
type: ObjectProperty
comment: Identifies specific times when the event occurs.
domain: Timing
range: dateTime
title: When the event occurs

Consent.provision.data.reference
type: ObjectProperty
comment: A reference to a specific resource that defines which resources are covered by this consent.
domain: Consent.provisionComponent.provisionDataComponent
range: Reference
title: The actual data reference

Claim.prescription
type: ObjectProperty
comment: Prescription to support the dispensing of Pharmacy or Vision products.
domain: Claim
range: Reference
title: Prescription authorizing services or products

InsurancePlan.coverage
type: ObjectProperty
comment: Details about the coverage offered by the insurance product.
domain: InsurancePlan
range: InsurancePlanCoverageComponent
title: Coverage details

Endpoint.header
type: ObjectProperty
comment: Additional headers / information to send as part of the notification.
domain: Endpoint
range: string
title: Usage depends on the channel type

PractitionerRole.period
type: ObjectProperty
comment: The period during which the person is authorized to act as a practitioner in these role(s) for the organization.
domain: PractitionerRole
range: Period
sub property of: when.done
title: The period during which the practitioner is authorized to perform in these role(s)

MedicationKnowledge.administrationGuidelines.indicationReference
type: ObjectProperty
domain: MedicationKnowledgeAdministrationGuidelinesComponent
range: Reference
sub property of: MedicationKnowledge.administrationGuidelines.indication

Device.deviceName
type: ObjectProperty
comment: This represents the manufacturer's name of the device as provided by the device, from a UDI label, or by a person describing the Device. This typically would be used when a person provides the name(s) or when the device represents one of the names available from DeviceDefinition.
domain: Device
range: DeviceDeviceNameComponent
title: The name of the device as given by the manufacturer

TestReportSetupComponent
type: Class
comment: The results of the series of required setup operations before the tests were executed.
subclass of: BackboneElement
subclass of: Restriction
  on property: TestReport.setup.action
  some values from: TestReportSetupComponent.SetupActionComponent

ExplanationOfBenefit.information.valueQuantity
type: ObjectProperty
domain: ExplanationOfBenefit.SupportingInformationComponent
range: Quantity
sub property of: ExplanationOfBenefit.information.value

MedicinalProductPackaged.marketingStatus
type: ObjectProperty
comment: Marketing information.
domain: MedicinalProductPackaged
range: MarketingStatus
title: Marketing information

ImmunizationEvaluation.series
type: ObjectProperty
comment: One possible path to achieve presumed immunity against a disease - within the context of an authority.
domain: ImmunizationEvaluation
range: string
title: Name of vaccine series

Questionnaire.item.item.initial
type: ObjectProperty
comment: One or more values that should be pre-populated in the answer when initially rendering the questionnaire for user input.
domain: QuestionnaireItemComponentItem
range: QuestionnaireItemComponentItem.QuestionnaireItemInitialComponent
title: Initial value(s) when item is first rendered

VerificationResult.primarySource.validationProcess
type: ObjectProperty
comment: Method for communicating with the primary source (manual; API; Push).
domain: VerificationResultPrimarySourceComponent
range: CodeableConcept
title: The process(es) by which the target is validated

Dosage
type: Class
comment: Indicates how the medication is/was taken or should be taken by the patient.
subclass of: BackboneElement
subclass of: Restriction
  all values from: CodeableConcept
  max cardinality: 1
  on property: Dosage.site
subclass of:
  union of: Restriction
    all values from: boolean
    max cardinality: 1
    on property: Dosage.asNeededBoolean
  union of: Restriction
    all values from: CodeableConcept
    max cardinality: 1
    on property: Dosage.asNeededCodeableConcept
subclass of: Restriction
  all values from: DosageDoseAndRateComponent
  on property: Dosage.doseAndRate
subclass of: Restriction
  all values from: integer
  max cardinality: 1
  on property: Dosage.sequence
subclass of: Restriction
  all values from: Timing
  max cardinality: 1
  on property: Dosage.timing
subclass of: Restriction
  all values from: CodeableConcept
  max cardinality: 1
  on property: Dosage.method
subclass of: Restriction
  all values from: SimpleQuantity
  max cardinality: 1
  on property: Dosage.maxDosePerAdministration
subclass of: Restriction
  all values from: string
  max cardinality: 1
  on property: Dosage.patientInstruction
subclass of: Restriction
  all values from: CodeableConcept
  max cardinality: 1
  on property: Dosage.route
subclass of: Restriction
  all values from: Ratio
  max cardinality: 1
  on property: Dosage.maxDosePerPeriod
subclass of: Restriction
  all values from: SimpleQuantity
  max cardinality: 1
  on property: Dosage.maxDosePerLifetime
subclass of: Restriction
  all values from: CodeableConcept
  on property: Dosage.additionalInstruction
subclass of: Restriction
  all values from: string
  max cardinality: 1
  on property: Dosage.text
title: How the medication is/was taken or should be taken

ServiceRequest.category
type: ObjectProperty
comment: A code that classifies the service for searching, sorting and display purposes (e.g. "Surgical Procedure").
domain: ServiceRequest
range: CodeableConcept
sub property of: class
title: Classification of service

VisionPrescription.dispense.sphere
type: ObjectProperty
comment: Lens power measured in dioptres (0.25 units).
domain: VisionPrescriptionDispenseComponent
range: decimal
title: Lens sphere

ValueSet.expansion.contains.contains.code
type: ObjectProperty
comment: The code for this item in the expansion hierarchy. If this code is missing the entry in the hierarchy is a place holder (abstract) and does not represent a valid code in the value set.
domain: ValueSetExpansionComponent.ValueSetExpansionContainsComponentContains
range: code
title: Code - if blank, this is not a selectable code

EncounterLocationComponent
type: Class
comment: List of locations where the patient has been during this encounter.
subclass of: BackboneElement
subclass of: Restriction
  all values from: Period
  max cardinality: 1
  on property: Encounter.location.period
subclass of: Restriction
  all values from: code
  max cardinality: 1
  on property: Encounter.location.status
subclass of: Restriction
  cardinality: 1
  on property: Encounter.location.location
  some values from: Reference

DeviceUseStatement.subject
type: ObjectProperty
comment: The patient who used the device.
domain: DeviceUseStatement
range: Reference
sub property of: who.focus
title: Patient using device

MedicationKnowledge.cost.cost
type: ObjectProperty
comment: The price of the medication.
domain: MedicationKnowledgeCostComponent
range: Money
title: The price of the medication

ExampleScenarioProcessComponent.ExampleScenarioProcessStepComponentProcess.ExampleScenarioProcessStepComponent.ExampleScenarioProcessStepOperationComponent
type: Class
comment: Each interaction or action.
subclass of: BackboneElement
subclass of: Restriction
  all values from: string
  max cardinality: 1
  on property: ExampleScenario.process.step.process.step.operation.name
subclass of: Restriction
  all values from: markdown
  max cardinality: 1
  on property: ExampleScenario.process.step.process.step.operation.description
subclass of: Restriction
  all values from: ExampleScenarioProcessComponent.ExampleScenarioProcessStepComponentProcess.ExampleScenarioProcessStepComponent.ExampleScenarioProcessStepOperationComponentContainedInstance
  max cardinality: 1
  on property: ExampleScenario.process.step.process.step.operation.request
subclass of: Restriction
  all values from: ExampleScenarioProcessComponent.ExampleScenarioProcessStepComponentProcess.ExampleScenarioProcessStepComponent.ExampleScenarioProcessStepOperationComponentContainedInstance
  max cardinality: 1
  on property: ExampleScenario.process.step.process.step.operation.response
subclass of: Restriction
  all values from: string
  max cardinality: 1
  on property: ExampleScenario.process.step.process.step.operation.type
subclass of: Restriction
  all values from: string
  max cardinality: 1
  on property: ExampleScenario.process.step.process.step.operation.receiver
subclass of: Restriction
  all values from: boolean
  max cardinality: 1
  on property: ExampleScenario.process.step.process.step.operation.receiverActive
subclass of: Restriction
  cardinality: 1
  on property: ExampleScenario.process.step.process.step.operation.number
  some values from: string
subclass of: Restriction
  all values from: string
  max cardinality: 1
  on property: ExampleScenario.process.step.process.step.operation.initiator
subclass of: Restriction
  all values from: boolean
  max cardinality: 1
  on property: ExampleScenario.process.step.process.step.operation.initiatorActive

ClaimResponse.NoteComponent
type: Class
comment: Note text.
subclass of: BackboneElement
subclass of: Restriction
  all values from: CodeableConcept
  max cardinality: 1
  on property: ClaimResponse.processNote.language
subclass of: Restriction
  all values from: string
  max cardinality: 1
  on property: ClaimResponse.processNote.text
subclass of: Restriction
  all values from: code
  max cardinality: 1
  on property: ClaimResponse.processNote.type
subclass of: Restriction
  all values from: positiveInt
  max cardinality: 1
  on property: ClaimResponse.processNote.number

ClaimResponse.item.noteNumber
type: ObjectProperty
comment: A list of note references to the notes provided below.
domain: ClaimResponse.ItemComponent
range: positiveInt
title: List of note numbers which apply

SupplyDelivery.status
type: ObjectProperty
comment: A code specifying the state of the dispense event.
domain: SupplyDelivery
range: code
title: in-progress | completed | abandoned | entered-in-error

Questionnaire.item.initial.valueDecimal
type: ObjectProperty
domain: QuestionnaireItemComponent.QuestionnaireItemInitialComponent
range: decimal
sub property of: Questionnaire.item.initial.value

TestScript.destination.profile
type: ObjectProperty
comment: The type of destination profile the test system supports.
domain: TestScriptDestinationComponent
range: Coding
title: FHIR-Server | FHIR-SDC-FormManager | FHIR-SDC-FormReceiver | FHIR-SDC-FormProcessor

Patient.gender
type: ObjectProperty
comment: Administrative Gender - the gender that the patient is considered to have for administration and record keeping purposes.
domain: Patient
range: code
title: male | female | other | unknown

ExplanationOfBenefit.item.detail.subDetail.unitPrice
type: ObjectProperty
comment: The fee for an addittional service or product or charge.
domain: ExplanationOfBenefit.ItemComponent.DetailComponent.SubDetailComponent
range: Money
title: Fee, charge or cost per point

ElementDefinitionBaseComponent
type: Class
comment: Information about the base definition of the element, provided to make it unnecessary for tools to trace the deviation of the element through the derived and related profiles. When the element definition is not the original definition of an element - i.g. either in a constraint on another type, or for elements from a super type in a snap shot - then the information in provided in the element definition may be different to the base definition. On the original definition of the element, it will be same.
subclass of: Element
subclass of: Restriction
  cardinality: 1
  on property: ElementDefinition.base.max
  some values from: string
subclass of: Restriction
  cardinality: 1
  on property: ElementDefinition.base.min
  some values from: unsignedInt
subclass of: Restriction
  cardinality: 1
  on property: ElementDefinition.base.path
  some values from: string

MedicinalProductAuthorization.status
type: ObjectProperty
comment: The status of the marketing authorization.
domain: MedicinalProductAuthorization
range: CodeableConcept
title: The status of the marketing authorization

ImplementationGuide.description
type: ObjectProperty
comment: A free text natural language description of the implementation guide from a consumer's perspective.
domain: ImplementationGuide
range: markdown
title: Natural language description of the implementation guide

MedicinalProductClinicals.contraindication.therapeuticIndication.comorbidity
type: ObjectProperty
comment: Comorbidity (concurrent condition) or co-infection as part of the indication.
domain: MedicinalProductClinicalsContraindicationComponentTherapeuticIndication
range: CodeableConcept
title: Comorbidity (concurrent condition) or co-infection as part of the indication

ExplanationOfBenefit.AddedItemComponent.AddedItemDetailComponent.AddedItemDetailSubDetailComponentAdjudication
type: Class
comment: The adjudication results.
subclass of: BackboneElement
subclass of: Restriction
  all values from: decimal
  max cardinality: 1
  on property: ExplanationOfBenefit.addItem.detail.subDetail.adjudication.value
subclass of: Restriction
  all values from: Money
  max cardinality: 1
  on property: ExplanationOfBenefit.addItem.detail.subDetail.adjudication.amount
subclass of: Restriction
  all values from: CodeableConcept
  max cardinality: 1
  on property: ExplanationOfBenefit.addItem.detail.subDetail.adjudication.reason
subclass of: Restriction
  cardinality: 1
  on property: ExplanationOfBenefit.addItem.detail.subDetail.adjudication.category
  some values from: CodeableConcept
title: Added items adjudication

TestScriptDestinationComponent
type: Class
comment: An abstract server used in operations within this test script in the destination element.
subclass of: BackboneElement
subclass of: Restriction
  cardinality: 1
  on property: TestScript.destination.profile
  some values from: Coding
subclass of: Restriction
  cardinality: 1
  on property: TestScript.destination.index
  some values from: integer

Sequence.repository.type
type: ObjectProperty
comment: Click and see / RESTful API / Need login to see / RESTful API with authentication / Other ways to see resource.
domain: SequenceRepositoryComponent
range: code
title: directlink | openapi | login | oauth | other

MessageDefinition.focus.min
type: ObjectProperty
comment: Identifies the minimum number of resources of this type that must be pointed to by a message in order for it to be valid against this MessageDefinition.
domain: MessageDefinitionFocusComponent
range: unsignedInt
title: Minimum number of focuses of this type

Each resource instance used by the initiator
type: Class
comment: Each resource instance used by the initiator.
comment: Each resource instance used by the responder.
label: ExampleScenarioProcessComponent.ExampleScenarioProcessStepComponent.ExampleScenarioProcessStepAlternativeComponent.ExampleScenarioProcessStepAlternativeOptionComponentStepProcess.ExampleScenarioProcessStepComponent.ExampleScenarioProcessStepOperationComponentContainedInstance
subclass of: BackboneElement
subclass of: Restriction
  cardinality: 1
  on property: ExampleScenario.process.step.alternative.option.step.process.step.operation.request.resourceId
  some values from: string
subclass of: Restriction
  all values from: string
  max cardinality: 1
  on property: ExampleScenario.process.step.alternative.option.step.process.step.operation.request.versionId
subclass of: Restriction
  cardinality: 1
  on property: ExampleScenario.process.step.alternative.option.step.process.step.operation.response.resourceId
  some values from: string
subclass of: Restriction
  all values from: string
  max cardinality: 1
  on property: ExampleScenario.process.step.alternative.option.step.process.step.operation.response.versionId
title: Each resource instance used by the responder

ExampleScenario.instance.version.versionId
type: ObjectProperty
comment: The identifier of a specific version of a resource.
domain: ExampleScenarioInstanceComponent.ExampleScenarioInstanceVersionComponent
range: string
title: The identifier of a specific version of a resource

FamilyMemberHistory.ageRange
type: ObjectProperty
domain: FamilyMemberHistory
range: Range
sub property of: FamilyMemberHistory.age

CoverageEligibilityResponse.patient
type: ObjectProperty
comment: Patient Resource.
domain: CoverageEligibilityResponse
range: Reference
sub property of: who.focus
title: The subject of the Products and Services

TerminologyCapabilities.title
type: ObjectProperty
comment: A short, descriptive, user-friendly title for the terminology capabilities.
domain: TerminologyCapabilities
range: string
title: Name for this terminology capabilities (human friendly)

ImmunizationEvaluation.targetDisease
type: ObjectProperty
comment: The vaccine preventable disease the dose is being evaluated against.
domain: ImmunizationEvaluation
range: CodeableConcept
title: Evaluation target disease

StructureMap.group.rule.rule.source.check
type: ObjectProperty
comment: FHIRPath expression - must be true or the mapping engine throws an error instead of completing.
domain: StructureMapGroupComponent.StructureMapGroupRuleComponentRule.StructureMapGroupRuleSourceComponent
range: string
title: FHIRPath expression - must be true or the mapping engine throws an error instead of completing

AppointmentResponse.appointment
type: ObjectProperty
comment: Appointment that this response is replying to.
domain: AppointmentResponse
range: Reference
title: Appointment this response relates to

ExplanationOfBenefit.addItem.locationCodeableConcept
type: ObjectProperty
domain: ExplanationOfBenefit.AddedItemComponent
range: CodeableConcept
sub property of: ExplanationOfBenefit.addItem.location

Communication.context
type: ObjectProperty
comment: The encounter within which the communication was sent.
domain: Communication
range: Reference
sub property of: context
title: Encounter or episode leading to message

MessageDefinition.jurisdiction
type: ObjectProperty
comment: A legal or geographic region in which the message definition is intended to be used.
domain: MessageDefinition
range: CodeableConcept
title: Intended jurisdiction for message definition (if applicable)

Claim.item
type: ObjectProperty
comment: First tier of goods and services.
domain: Claim
range: Claim.ItemComponent
title: Goods and Services

Encounter.ClassHistoryComponent
type: Class
comment: The class history permits the tracking of the encounters transitions without needing to go through the resource history. This would be used for a case where an admission starts of as an emergency encounter, then transisions into an inpatient scenario. Doing this and not restarting a new encounter ensures that any lab/diagnostic results can more easily follow the patient and not require re-processing and not get lost or cancelled during a kindof discharge from emergency to inpatient.
subclass of: BackboneElement
subclass of: Restriction
  cardinality: 1
  on property: Encounter.classHistory.period
  some values from: Period
subclass of: Restriction
  cardinality: 1
  on property: Encounter.classHistory.class
  some values from: Coding

DeviceDefinitionCapabilityComponent
type: Class
comment: Device capabilities.
subclass of: BackboneElement
subclass of: Restriction
  all values from: CodeableConcept
  on property: DeviceDefinition.capability.description
subclass of: Restriction
  cardinality: 1
  on property: DeviceDefinition.capability.type
  some values from: CodeableConcept

PlanDefinition.action.relatedAction.actionId
type: ObjectProperty
comment: The element id of the related action.
domain: PlanDefinitionActionComponent.PlanDefinitionActionRelatedActionComponent
range: id
title: What action is this related to

TestReport.teardown.action.operation.detail
type: ObjectProperty
comment: A link to further details on the result.
domain: TestReportTeardownComponent.TeardownActionComponentOperation
range: uri
title: A link to further details on the result

DocumentReference.context.encounter
type: ObjectProperty
comment: Describes the clinical encounter or type of care that the document content is associated with.
domain: DocumentReferenceContextComponent
range: Reference
sub property of: context
title: Context of the document content

Person
type: Class
comment: Demographics and administrative information about a person independent of a specific health-related context.
subclass of: administrative.entity
subclass of: DomainResource
subclass of: Restriction
  all values from: PersonLinkComponent
  on property: Person.link
subclass of: Restriction
  all values from: date
  max cardinality: 1
  on property: Person.birthDate
subclass of: Restriction
  all values from: boolean
  max cardinality: 1
  on property: Person.active
subclass of: Restriction
  all values from: code
  max cardinality: 1
  on property: Person.gender
subclass of: Restriction
  all values from: Reference
  max cardinality: 1
  on property: Person.managingOrganization
subclass of: Restriction
  all values from: ContactPoint
  on property: Person.telecom
subclass of: Restriction
  all values from: Attachment
  max cardinality: 1
  on property: Person.photo
subclass of: Restriction
  all values from: HumanName
  on property: Person.name
subclass of: Restriction
  all values from: Address
  on property: Person.address
subclass of: Restriction
  all values from: Identifier
  on property: Person.identifier

Bundle.entry.link.relation
type: ObjectProperty
comment: A name which details the functional use for this link - see [http://www.iana.org/assignments/link-relations/link-relations.xhtml#link-relations-1](http://www.iana.org/assignments/link-relations/link-relations.xhtml#link-relations-1).
domain: BundleEntryComponentLink
range: string
title: See http://www.iana.org/assignments/link-relations/link-relations.xhtml#link-relations-1

PaymentNotice.created
type: ObjectProperty
comment: The date when this resource was created.
domain: PaymentNotice
range: dateTime
sub property of: when.recorded
title: Creation date

Device.specialization.systemType
type: ObjectProperty
comment: The standard that is used to operate and communicate.
domain: DeviceSpecializationComponent
range: CodeableConcept
title: The standard that is used to operate and communicate

Encounter.classHistory.period
type: ObjectProperty
comment: The time that the episode was in the specified class.
domain: Encounter.ClassHistoryComponent
range: Period
title: The time that the episode was in the specified class

Encounter.hospitalization.dischargeDisposition
type: ObjectProperty
comment: Category or kind of location after discharge.
domain: EncounterHospitalizationComponent
range: CodeableConcept
title: Category or kind of location after discharge

CodeSystem.name
type: ObjectProperty
comment: A natural language name identifying the code system. This name should be usable as an identifier for the module by machine processing applications such as code generation.
domain: CodeSystem
range: string
title: Name for this code system (computer friendly)

Extension
type: Class
comment: Optional Extension Element - found in all resources.
subclass of: Element
subclass of: Restriction
  all values from: Element
  max cardinality: 1
  on property: Extension.value
subclass of: Restriction
  cardinality: 1
  on property: Extension.url
  some values from: uri
title: Optional Extensions Element

StructureMapGroupComponent.StructureMapGroupRuleComponentRuleRule
type: Class
comment: Rules contained in this rule.
subclass of: BackboneElement
title: Rules contained in this rule

EventDefinition.useContext
type: ObjectProperty
comment: The content was developed with a focus and intent of supporting the contexts that are listed. These terms may be used to assist with indexing and searching for appropriate event definition instances.
domain: EventDefinition
range: UsageContext
title: The context that the content is intended to support

ConceptMapGroupComponent
type: Class
comment: A group of mappings that all have the same source and target system.
subclass of: BackboneElement
subclass of: Restriction
  on property: ConceptMap.group.element
  some values from: ConceptMapGroupComponent.SourceElementComponent
subclass of: Restriction
  all values from: uri
  max cardinality: 1
  on property: ConceptMap.group.target
subclass of: Restriction
  all values from: uri
  max cardinality: 1
  on property: ConceptMap.group.source
subclass of: Restriction
  all values from: ConceptMapGroupComponent.ConceptMapGroupUnmappedComponent
  max cardinality: 1
  on property: ConceptMap.group.unmapped
subclass of: Restriction
  all values from: string
  max cardinality: 1
  on property: ConceptMap.group.sourceVersion
subclass of: Restriction
  all values from: string
  max cardinality: 1
  on property: ConceptMap.group.targetVersion

SubstanceReferenceInformation.relationship
type: ObjectProperty
comment: Todo.
domain: SubstanceReferenceInformation
range: SubstanceReferenceInformationRelationshipComponent
title: Todo

Questionnaire.subjectType
type: ObjectProperty
comment: The types of subjects that can be the subject of responses created for the questionnaire.
domain: Questionnaire
range: code
title: Resource that can be subject of QuestionnaireResponse

Claim.item.detail.factor
type: ObjectProperty
comment: A real number that represents a multiplier used in determining the overall value of services delivered and/or goods received. The concept of a Factor allows for a discount or surcharge multiplier to be applied to a monetary amount.
domain: Claim.ItemComponent.DetailComponent
range: decimal
title: Price scaling factor

Questionnaire.item.initial.valueAttachment
type: ObjectProperty
domain: QuestionnaireItemComponent.QuestionnaireItemInitialComponent
range: Attachment
sub property of: Questionnaire.item.initial.value

QuestionnaireResponse.item.answer.item
type: ObjectProperty
comment: Nested groups and/or questions found within this particular answer.
domain: QuestionnaireResponseItemComponent.QuestionnaireResponseItemAnswerComponent
range: QuestionnaireResponseItemComponent.QuestionnaireResponseItemAnswerComponentItem
title: Nested groups and questions

RelatedArtifact.document
type: ObjectProperty
comment: The document being referenced, represented as an attachment. This is exclusive with the resource element.
domain: RelatedArtifact
range: Attachment
title: What document is being referenced

Claim.item.procedureSequence
type: ObjectProperty
comment: Procedures applicable for this service or product line.
domain: Claim.ItemComponent
range: positiveInt
title: Applicable procedures

MedicinalProduct
type: Class
comment: Detailed definition of a medicinal product, typically for uses other than direct patient care (e.g. regulatory use).
subclass of: clinical.medication
subclass of: DomainResource
subclass of: Restriction
  all values from: Reference
  on property: MedicinalProduct.interaction
subclass of: Restriction
  all values from: Reference
  on property: MedicinalProduct.attachedDocument
subclass of: Restriction
  all values from: CodeableConcept
  max cardinality: 1
  on property: MedicinalProduct.combinedPharmaceuticalDoseForm
subclass of: Restriction
  all values from: CodeableConcept
  max cardinality: 1
  on property: MedicinalProduct.type
subclass of: Restriction
  all values from: MedicinalProductSpecialDesignationComponent
  on property: MedicinalProduct.specialDesignation
subclass of: Restriction
  all values from: Reference
  on property: MedicinalProduct.packagedMedicinalProduct
subclass of: Restriction
  all values from: CodeableConcept
  max cardinality: 1
  on property: MedicinalProduct.additionalMonitoringIndicator
subclass of: Restriction
  all values from: Coding
  max cardinality: 1
  on property: MedicinalProduct.domain
subclass of: Restriction
  all values from: Reference
  on property: MedicinalProduct.pharmaceuticalProduct
subclass of: Restriction
  all values from: Reference
  on property: MedicinalProduct.therapeuticIndication
subclass of: Restriction
  on property: MedicinalProduct.name
  some values from: MedicinalProductNameComponent
subclass of: Restriction
  all values from: Reference
  on property: MedicinalProduct.undesirableEffect
subclass of: Restriction
  all values from: Reference
  on property: MedicinalProduct.contact
subclass of: Restriction
  all values from: Reference
  on property: MedicinalProduct.masterFile
subclass of: Restriction
  all values from: Identifier
  on property: MedicinalProduct.identifier
subclass of: Restriction
  all values from: Identifier
  on property: MedicinalProduct.crossReference
subclass of: Restriction
  all values from: MedicinalProductManufacturingBusinessOperationComponent
  on property: MedicinalProduct.manufacturingBusinessOperation
subclass of: Restriction
  all values from: string
  on property: MedicinalProduct.specialMeasures
subclass of: Restriction
  all values from: MarketingStatus
  on property: MedicinalProduct.marketingStatus
subclass of: Restriction
  all values from: CodeableConcept
  max cardinality: 1
  on property: MedicinalProduct.paediatricUseIndicator
subclass of: Restriction
  all values from: Reference
  max cardinality: 1
  on property: MedicinalProduct.marketingAuthorization
subclass of: Restriction
  all values from: CodeableConcept
  on property: MedicinalProduct.productClassification
subclass of: Restriction
  all values from: Reference
  on property: MedicinalProduct.contraindication
subclass of: Restriction
  all values from: Reference
  on property: MedicinalProduct.clinicalTrial

TestScript.setup.action.operation.targetId
type: ObjectProperty
comment: Id of fixture used for extracting the [id], [type], and [vid] for GET requests.
domain: TestScriptSetupComponent.SetupActionComponent.SetupActionOperationComponent
range: id
title: Id of fixture used for extracting the [id], [type], and [vid] for GET requests

Composition.section.section.mode
type: ObjectProperty
comment: How the entry list was prepared - whether it is a working list that is suitable for being maintained on an ongoing basis, or if it represents a snapshot of a list of items from another source, or whether it is a prepared list where items may be marked as added, modified or deleted.
domain: Composition.SectionComponentSection
range: code
sub property of: class
title: working | snapshot | changes

InsurancePlan.plan.specificCost.benefit
type: ObjectProperty
comment: List of the specific benefits under this category of benefit.
domain: InsurancePlanPlanComponent.InsurancePlanPlanSpecificCostComponent
range: InsurancePlanPlanComponent.InsurancePlanPlanSpecificCostComponent.PlanBenefitComponent
title: Benefits list

Questionnaire.item.initial.valueTime
type: ObjectProperty
domain: QuestionnaireItemComponent.QuestionnaireItemInitialComponent
range: time
sub property of: Questionnaire.item.initial.value

Reference.reference
type: ObjectProperty
comment: A reference to a location at which the other resource is found. The reference may be a relative reference, in which case it is relative to the service base URL, or an absolute URL that resolves to the location where the resource is found. The reference may be version specific or not. If the reference is not to a FHIR RESTful server, then it should be assumed to be version specific. Internal fragment references (start with '#') refer to contained resources.
domain: Reference
range: string
title: Literal reference, Relative, internal or absolute URL

MedicinalProductClinicals.contraindication.otherTherapy.therapyRelationshipType
type: ObjectProperty
comment: The type of relationship between the medicinal product indication or contraindication and another therapy.
domain: MedicinalProductClinicalsContraindicationComponentOtherTherapy
range: CodeableConcept
title: The type of relationship between the medicinal product indication or contraindication and another therapy

Contract.contentDefinition.publicationStatus
type: ObjectProperty
comment: draft | active | retired | unknown.
domain: Contract.ContentDefinitionComponent
range: code
title: draft | active | retired | unknown

Device.safety
type: ObjectProperty
comment: Provides additional safety characteristics about a medical device. For example devices containing latex.
domain: Device
range: CodeableConcept
title: Safety Characteristics of Device

TestReport.test.action.operation.detail
type: ObjectProperty
comment: A link to further details on the result.
domain: TestReportTestComponent.TestActionComponentOperation
range: uri
title: A link to further details on the result

BiologicallyDerivedProduct.processing.timePeriod
type: ObjectProperty
domain: BiologicallyDerivedProductProcessingComponent
range: Period
sub property of: BiologicallyDerivedProduct.processing.time

DocumentManifest
type: Class
comment: A collection of documents compiled for a purpose together with metadata that applies to the collection.
subclass of: infrastructure.documents
subclass of: DomainResource
subclass of: Restriction
  all values from: Reference
  on property: DocumentManifest.recipient
subclass of: Restriction
  all values from: Identifier
  on property: DocumentManifest.identifier
subclass of: Restriction
  all values from: Identifier
  max cardinality: 1
  on property: DocumentManifest.masterIdentifier
subclass of: Restriction
  all values from: uri
  max cardinality: 1
  on property: DocumentManifest.source
subclass of: Restriction
  all values from: string
  max cardinality: 1
  on property: DocumentManifest.description
subclass of: Restriction
  cardinality: 1
  on property: DocumentManifest.status
  some values from: code
subclass of: Restriction
  on property: DocumentManifest.content
  some values from: Reference
subclass of: Restriction
  all values from: CodeableConcept
  max cardinality: 1
  on property: DocumentManifest.type
subclass of: Restriction
  all values from: Reference
  max cardinality: 1
  on property: DocumentManifest.subject
subclass of: Restriction
  all values from: dateTime
  max cardinality: 1
  on property: DocumentManifest.created
subclass of: Restriction
  all values from: DocumentManifestAgentComponent
  on property: DocumentManifest.agent
subclass of: Restriction
  all values from: DocumentManifestRelatedComponent
  on property: DocumentManifest.related

ServiceRequest.supportingInfo
type: ObjectProperty
comment: Additional clinical information about the patient or specimen that may influence the services or their interpretations. This information includes diagnosis, clinical findings and other observations. In laboratory ordering these are typically referred to as "ask at order entry questions (AOEs)". This includes observations explicitly requested by the producer (filler) to provide context or supporting information needed to complete the order. For example, reporting the amount of inspired oxygen for blood gas measurements.
domain: ServiceRequest
range: Reference
title: Additional clinical information

ClaimResponse.AddedItemComponent.AddedItemDetailComponentAdjudication
type: Class
comment: The adjudication results.
subclass of: BackboneElement
subclass of: Restriction
  all values from: decimal
  max cardinality: 1
  on property: ClaimResponse.addItem.detail.adjudication.value
subclass of: Restriction
  all values from: Money
  max cardinality: 1
  on property: ClaimResponse.addItem.detail.adjudication.amount
subclass of: Restriction
  all values from: CodeableConcept
  max cardinality: 1
  on property: ClaimResponse.addItem.detail.adjudication.reason
subclass of: Restriction
  cardinality: 1
  on property: ClaimResponse.addItem.detail.adjudication.category
  some values from: CodeableConcept
title: Added items detail adjudication

Consent.provision.period
type: ObjectProperty
comment: The timeframe in this rule is valid.
domain: Consent.provisionComponent
range: Period
title: Timeframe for this rule

TerminologyCapabilities.closure.translation
type: ObjectProperty
comment: If cross-system closure is supported.
domain: TerminologyCapabilitiesClosureComponent
range: boolean
title: If cross-system closure is supported

CoverageEligibilityResponse.insurer
type: ObjectProperty
comment: The Insurer who produced this adjudicated response.
domain: CoverageEligibilityResponse
range: Reference
title: Insurer issuing the coverage

MedicationKnowledge.administrationGuidelines.patientCharacteristics.characteristic
type: ObjectProperty

UserSession.context
type: ObjectProperty
comment: Provides additional information associated with the context.
domain: UserSession
range: UserSessionContextComponent
sub property of: context
title: Additional information about the session

Immunization.location
type: ObjectProperty
comment: The service delivery location where the vaccine administration occurred.
domain: Immunization
range: Reference
sub property of: where
title: Where immunization occurred

Contract.term.asset.valuedItem.factor
type: ObjectProperty
comment: A real number that represents a multiplier used in determining the overall value of the Contract Valued Item delivered. The concept of a Factor allows for a discount or surcharge multiplier to be applied to a monetary amount.
domain: Contract.TermComponent.ContractAssetComponent.ValuedItemComponent
range: decimal
sub property of: what
title: Contract Valued Item Price Scaling Factor

Observation.encounter
type: ObjectProperty
comment: The healthcare event (e.g. a patient and healthcare provider interaction) during which this observation is made.
domain: Observation
range: Reference
sub property of: context
title: Healthcare event during which this observation is made

VisionPrescription.dispense.diameter
type: ObjectProperty
comment: Contact lens diameter measured in millimetres.
domain: VisionPrescriptionDispenseComponent
range: decimal
title: Contact lens diameter

ActivityDefinition.subjectReference
type: ObjectProperty
domain: ActivityDefinition
range: Reference
sub property of: ActivityDefinition.subject

Meta.lastUpdated
type: ObjectProperty
comment: When the resource last changed - e.g. when the version changed.
domain: Meta
range: instant
title: When the resource version last changed

PlanDefinition.goal.target.detailQuantity
type: ObjectProperty
domain: PlanDefinitionGoalComponent.PlanDefinitionGoalTargetComponent
range: Quantity
sub property of: PlanDefinition.goal.target.detail

ImmunizationRecommendation.recommendation.dateCriterion.code
type: ObjectProperty
comment: Date classification of recommendation. For example, earliest date to give, latest date to give, etc.
domain: ImmunizationRecommendationRecommendationComponent.ImmunizationRecommendationRecommendationDateCriterionComponent
range: CodeableConcept
title: Type of date

MedicinalProductUndesirableEffect.population.age
type: ObjectProperty

Meta
type: Class
comment: The metadata about a resource. This is content in the resource that is maintained by the infrastructure. Changes to the content might not always be associated with version changes to the resource.
subclass of: Element
subclass of: Restriction
  all values from: canonical
  on property: Meta.profile
subclass of: Restriction
  all values from: instant
  max cardinality: 1
  on property: Meta.lastUpdated
subclass of: Restriction
  all values from: Coding
  on property: Meta.tag
subclass of: Restriction
  all values from: id
  max cardinality: 1
  on property: Meta.versionId
subclass of: Restriction
  all values from: Coding
  on property: Meta.security
subclass of: Restriction
  all values from: uri
  max cardinality: 1
  on property: Meta.source
title: Metadata about a resource

Meta.versionId
type: ObjectProperty
comment: The version specific identifier, as it appears in the version portion of the URL. This value changes when the resource is created, updated, or deleted.
domain: Meta
range: id
title: Version specific identifier

SubstanceReferenceInformation.target.organismType
type: ObjectProperty
comment: Todo.
domain: SubstanceReferenceInformationTargetComponent
range: CodeableConcept
title: Todo

Questionnaire.item.item.item
type: ObjectProperty
comment: Text, questions and other groups to be nested beneath a question or group.
domain: QuestionnaireItemComponentItem
range: QuestionnaireItemComponentItemItem
title: Nested questionnaire items

Timing.repeat.periodUnit
type: ObjectProperty
comment: The units of time for the period in UCUM units.
domain: TimingRepeatComponent
range: code
title: s | min | h | d | wk | mo | a - unit of time (UCUM)

DiagnosticReport
type: Class
comment: The findings and interpretation of diagnostic tests performed on patients, groups of patients, devices, and locations, and/or specimens derived from these. The report includes clinical context such as requesting and provider information, and some mix of atomic results, images, textual and coded interpretations, and formatted representation of diagnostic reports.
subclass of: DomainResource
subclass of: clinical.diagnostics
subclass of: Restriction
  all values from: Reference
  max cardinality: 1
  on property: DiagnosticReport.subject
subclass of: Restriction
  all values from: Reference
  on property: DiagnosticReport.specimen
subclass of: Restriction
  all values from: Identifier
  on property: DiagnosticReport.identifier
subclass of: Restriction
  all values from: string
  max cardinality: 1
  on property: DiagnosticReport.conclusion
subclass of: Restriction
  all values from: Reference
  on property: DiagnosticReport.result
subclass of: Restriction
  all values from: CodeableConcept
  max cardinality: 1
  on property: DiagnosticReport.category
subclass of: Restriction
  cardinality: 1
  on property: DiagnosticReport.code
  some values from: CodeableConcept
subclass of: Restriction
  all values from: Reference
  on property: DiagnosticReport.basedOn
subclass of: Restriction
  all values from: DiagnosticReportMediaComponent
  on property: DiagnosticReport.media
subclass of: Restriction
  all values from: Reference
  max cardinality: 1
  on property: DiagnosticReport.context
subclass of: Restriction
  cardinality: 1
  on property: DiagnosticReport.status
  some values from: code
subclass of: Restriction
  all values from: Reference
  on property: DiagnosticReport.performer
subclass of: Restriction
  all values from: Reference
  on property: DiagnosticReport.resultsInterpreter
subclass of: Restriction
  all values from: instant
  max cardinality: 1
  on property: DiagnosticReport.issued
subclass of: Restriction
  all values from: CodeableConcept
  on property: DiagnosticReport.conclusionCode
subclass of: Restriction
  all values from: Reference
  on property: DiagnosticReport.imagingStudy
subclass of:
  union of: Restriction
    all values from: dateTime
    max cardinality: 1
    on property: DiagnosticReport.effectiveDateTime
  union of: Restriction
    all values from: Period
    max cardinality: 1
    on property: DiagnosticReport.effectivePeriod
subclass of: Restriction
  all values from: Attachment
  on property: DiagnosticReport.presentedForm

TestScript.teardown.action.operation.targetId
type: ObjectProperty
comment: Id of fixture used for extracting the [id], [type], and [vid] for GET requests.
domain: TestScriptTeardownComponent.TeardownActionComponentOperation
range: id
title: Id of fixture used for extracting the [id], [type], and [vid] for GET requests

Contract.term.topic
type: ObjectProperty

MedicationStatement.reasonCode
type: ObjectProperty
comment: A reason for why the medication is being/was taken.
domain: MedicationStatement
range: CodeableConcept
sub property of: why
title: Reason for why the medication is being/was taken

StructureMap.group.rule.source.listMode
type: ObjectProperty
comment: How to handle the list mode for this element.
domain: StructureMapGroupComponent.StructureMapGroupRuleComponent.StructureMapGroupRuleSourceComponent
range: code
title: first | not_first | last | not_last | only_one

UsageContext.valueRange
type: ObjectProperty
domain: UsageContext
range: Range
sub property of: UsageContext.value

MedicinalProductIndication.population.age
type: ObjectProperty

AuditEvent.source.observer
type: ObjectProperty
comment: Identifier of the source where the event was detected.
domain: AuditEventSourceComponent
range: Reference
sub property of: who.witness
title: The identity of source detecting the event

ExampleScenario.process.step.process.step.alternative.option.step.operation.response.resourceId
type: ObjectProperty
comment: Each resource contained in the instance.
domain: ExampleScenarioProcessComponent.ExampleScenarioProcessStepComponentProcess.ExampleScenarioProcessStepComponent.ExampleScenarioProcessStepAlternativeComponent.ExampleScenarioProcessStepAlternativeOptionComponentStep.ExampleScenarioProcessStepOperationComponentContainedInstance
range: string
title: Each resource contained in the instance

Observation.valueTime
type: ObjectProperty
domain: Observation
range: time
sub property of: Observation.value

QuestionnaireResponse.item.answer.valueReference
type: ObjectProperty
domain: QuestionnaireResponseItemComponent.QuestionnaireResponseItemAnswerComponent
range: Reference
sub property of: QuestionnaireResponse.item.answer.value

AdverseEvent.recorder
type: ObjectProperty
comment: Information on who recorded the adverse event. May be the patient or a practitioner.
domain: AdverseEvent
range: Reference
sub property of: who.author
title: Who recorded the adverse event

RequestGroup.action.action.timingDuration
type: ObjectProperty
domain: RequestGroupActionComponentAction
range: Duration
sub property of: RequestGroup.action.action.timing

Contract.term.group.asset.context.text
type: ObjectProperty
comment: Context description.
domain: Contract.TermComponentTerm.ContractAssetComponent.AssetContextComponent
range: string
title: Context description

NamingSystem.uniqueId.value
type: ObjectProperty
comment: The string that should be sent over the wire to identify the code system or identifier system.
domain: NamingSystemUniqueIdComponent
range: string
sub property of: id
title: The unique identifier

Device.modelNumber
type: ObjectProperty
comment: The model number for the device.
domain: Device
range: string
sub property of: what
title: The model number for the device

PlanDefinition.date
type: ObjectProperty
comment: The date (and optionally time) when the plan definition was published. The date must change when the business version changes and it must change if the status code changes. In addition, it should change when the substantive content of the plan definition changes.
domain: PlanDefinition
range: dateTime
sub property of: when.recorded
title: Date last changed

MedicinalProductUndesirableEffect.population
type: ObjectProperty
comment: The population group to which this applies.
domain: MedicinalProductUndesirableEffect
range: MedicinalProductUndesirableEffectPopulationComponent
title: The population group to which this applies

Consent.category
type: ObjectProperty
comment: A classification of the type of consents found in the statement. This element supports indexing and retrieval of consent statements.
domain: Consent
range: CodeableConcept
sub property of: class
title: Classification of the consent statement - for indexing/retrieval

SubstanceSpecification.substanceName.language
type: ObjectProperty
comment: Language of the name.
domain: SubstanceSpecificationSubstanceNameComponent
range: CodeableConcept
title: Language of the name

Contract.rule.content
type: ObjectProperty

ProductShelfLife.identifier
type: ObjectProperty
comment: Unique identifier for the packaged Medicinal Product.
domain: ProductShelfLife
range: Identifier
title: Unique identifier for the packaged Medicinal Product

SampledData.factor
type: ObjectProperty
comment: A correction factor that is applied to the sampled data points before they are added to the origin.
domain: SampledData
range: decimal
title: Multiply data by this before adding to origin

Contract.site
type: ObjectProperty
comment: Sites in which the contract is complied with, exercised, or in force.
domain: Contract
range: Reference
title: Specific Location

FamilyMemberHistory.reasonCode
type: ObjectProperty
comment: Describes why the family member history occurred in coded or textual form.
domain: FamilyMemberHistory
range: CodeableConcept
sub property of: why
title: Why was family member history performed?

CoverageEligibilityRequest.item.provider
type: ObjectProperty
comment: The practitioner who is responsible for the services rendered to the patient.
domain: CoverageEligibilityRequest.DetailsComponent
range: Reference
sub property of: who.source
title: Perfoming practitioner

SubstanceReferenceInformation.relationship.substanceReference
type: ObjectProperty
domain: SubstanceReferenceInformationRelationshipComponent
range: Reference
sub property of: SubstanceReferenceInformation.relationship.substance

InsurancePlan.plan.specificCost.benefit.type
type: ObjectProperty
comment: Type of specific benefit (preventative; primary care office visit; speciality office visit; hospitalization; emergency room; urgent care).
domain: InsurancePlanPlanComponent.InsurancePlanPlanSpecificCostComponent.PlanBenefitComponent
range: CodeableConcept
title: Type of specific benefit

ElementDefinition.base.path
type: ObjectProperty
comment: The Path that identifies the base element - this matches the ElementDefinition.path for that element. Across FHIR, there is only one base definition of any element - that is, an element definition on a [StructureDefinition] without a StructureDefinition.base.
domain: ElementDefinitionBaseComponent
range: string
title: Path that identifies the base element

StructureMap.group.rule.rule.source.defaultValue
type: ObjectProperty
domain: StructureMapGroupComponent.StructureMapGroupRuleComponentRule.StructureMapGroupRuleSourceComponent
range: Element

ImplementationGuide.definition.resource.exampleCanonical
type: ObjectProperty
domain: ImplementationGuideDefinitionComponent.ImplementationGuideDefinitionResourceComponent
range: canonical
sub property of: ImplementationGuide.definition.resource.example

NutritionOrder.enteralFormula.administration.rate
type: ObjectProperty

PlanDefinition.action.participant.type
type: ObjectProperty
comment: The type of participant in the action.
domain: PlanDefinitionActionComponent.PlanDefinitionActionParticipantComponent
range: code
title: patient | practitioner | related-person | device

FamilyMemberHistory.bornPeriod
type: ObjectProperty
domain: FamilyMemberHistory
range: Period
sub property of: FamilyMemberHistory.born

FamilyMemberHistory.relationship
type: ObjectProperty
comment: The type of relationship this person has to the patient (father, mother, brother etc.).
domain: FamilyMemberHistory
range: CodeableConcept
title: Relationship to the subject

Contract.term.group.action.reason
type: ObjectProperty
comment: Describes why the action is to be performed or not performed in textual form.
domain: Contract.TermComponentTerm.ActionComponent
range: string
title: Why action is to be performed

MedicinalProduct.attachedDocument
type: ObjectProperty
comment: Supporting documentation, typically for regulatory submission.
domain: MedicinalProduct
range: Reference
title: Supporting documentation, typically for regulatory submission

ExampleScenarioProcessComponent.ExampleScenarioProcessStepComponent.ExampleScenarioProcessStepAlternativeComponent
type: Class
comment: Each interaction in the workflow.
subclass of: BackboneElement
subclass of: Restriction
  on property: ExampleScenario.process.step.alternative.option
  some values from: ExampleScenarioProcessComponent.ExampleScenarioProcessStepComponent.ExampleScenarioProcessStepAlternativeComponent.ExampleScenarioProcessStepAlternativeOptionComponent
subclass of: Restriction
  all values from: string
  max cardinality: 1
  on property: ExampleScenario.process.step.alternative.name

CapabilityStatement.software.releaseDate
type: ObjectProperty
comment: Date this version of the software was released.
domain: CapabilityStatementSoftwareComponent
range: dateTime
title: Date this version was released

ExampleScenario.instance.resourceId
type: ObjectProperty
comment: The id of the resource for referencing.
domain: ExampleScenarioInstanceComponent
range: string
title: The id of the resource for referencing

GraphDefinition.link.path
type: ObjectProperty
comment: A FHIR expression that identifies one of FHIR References to other resources.
domain: GraphDefinitionLinkComponent
range: string
title: Path in the resource that contains the link

TestScript.test.action.assert.responseCode
type: ObjectProperty
comment: The value of the HTTP response code to be tested.
domain: TestScriptTestComponent.TestActionComponentAssert
range: string
title: HTTP response code to test

Contract.rule.contentReference
type: ObjectProperty
domain: Contract.ComputableLanguageComponent
range: Reference
sub property of: Contract.rule.content

PaymentNotice
type: Class
comment: This resource provides the status of the payment for goods and services rendered, and the request and response resource references.
subclass of: financial.payment
subclass of: DomainResource
subclass of: Restriction
  all values from: code
  max cardinality: 1
  on property: PaymentNotice.status
subclass of: Restriction
  all values from: Reference
  max cardinality: 1
  on property: PaymentNotice.target
subclass of: Restriction
  all values from: Identifier
  on property: PaymentNotice.identifier
subclass of: Restriction
  all values from: Reference
  max cardinality: 1
  on property: PaymentNotice.response
subclass of: Restriction
  all values from: dateTime
  max cardinality: 1
  on property: PaymentNotice.created
subclass of: Restriction
  all values from: CodeableConcept
  max cardinality: 1
  on property: PaymentNotice.paymentStatus
subclass of: Restriction
  all values from: Reference
  max cardinality: 1
  on property: PaymentNotice.request
subclass of: Restriction
  all values from: date
  max cardinality: 1
  on property: PaymentNotice.statusDate
subclass of: Restriction
  all values from: Reference
  max cardinality: 1
  on property: PaymentNotice.provider

Bundle.signature
type: ObjectProperty
comment: Digital Signature - base64 encoded. XML-DSig or a JWT.
domain: Bundle
range: Signature
title: Digital Signature

Quantity.comparator
type: ObjectProperty
comment: How the value should be understood and represented - whether the actual value is greater or less than the stated value due to measurement issues; e.g. if the comparator is "<" , then the real value is < stated value.
domain: Quantity
range: code
title: < | <= | >= | > - how to understand the value

Questionnaire.item.item.answerOption.value
type: ObjectProperty

ClaimResponse.AddedItemComponent.AddedItemDetailComponent
type: Class
comment: The second-tier service adjudications for payor added services.
subclass of: BackboneElement
subclass of: Restriction
  all values from: CodeableConcept
  max cardinality: 1
  on property: ClaimResponse.addItem.detail.billcode
subclass of: Restriction
  all values from: CodeableConcept
  on property: ClaimResponse.addItem.detail.modifier
subclass of: Restriction
  all values from: SimpleQuantity
  max cardinality: 1
  on property: ClaimResponse.addItem.detail.quantity
subclass of: Restriction
  all values from: ClaimResponse.AddedItemComponent.AddedItemDetailComponentAdjudication
  on property: ClaimResponse.addItem.detail.adjudication
subclass of: Restriction
  all values from: Money
  max cardinality: 1
  on property: ClaimResponse.addItem.detail.unitPrice
subclass of: Restriction
  all values from: ClaimResponse.AddedItemComponent.AddedItemDetailComponent.AddedItemSubDetailComponent
  on property: ClaimResponse.addItem.detail.subDetail
subclass of: Restriction
  all values from: decimal
  max cardinality: 1
  on property: ClaimResponse.addItem.detail.factor
subclass of: Restriction
  all values from: Money
  max cardinality: 1
  on property: ClaimResponse.addItem.detail.net
subclass of: Restriction
  all values from: positiveInt
  on property: ClaimResponse.addItem.detail.noteNumber

MedicationRequest.detectedIssue
type: ObjectProperty
comment: Indicates an actual or potential clinical issue with or between one or more active or proposed clinical actions for a patient; e.g. Drug-drug interaction, duplicate therapy, dosage alert etc.
domain: MedicationRequest
range: Reference
title: Clinical Issue with action

ExplanationOfBenefit.addItem.detail.net
type: ObjectProperty
comment: The quantity times the unit price for an additional service or product or charge. For example, the formula: unit Quantity * unit Price (Cost per Point) * factor Number * points = net Amount. Quantity, factor and points are assumed to be 1 if not supplied.
domain: ExplanationOfBenefit.AddedItemComponent.AddedItemDetailComponent
range: Money
title: Total item cost

SubstanceSpecification.structure.isotope.molecularWeight.amount
type: ObjectProperty
comment: Used to capture quantitative values for a variety of elements. If only limits are given, the arithmetic mean would be the average. If only a single definite value for a given element is given, it would be captured in this field.
domain: SubstanceSpecificationStructureComponent.SubstanceSpecificationStructureIsotopeComponent.SubstanceSpecificationStructureIsotopeMolecularWeightComponent
range: string
title: Used to capture quantitative values for a variety of elements. If only limits are given, the arithmetic mean would be the average. If only a single definite value for a given element is given, it would be captured in this field

Questionnaire.item.enableWhen.answerReference
type: ObjectProperty
domain: QuestionnaireItemComponent.QuestionnaireItemEnableWhenComponent
range: Reference
sub property of: Questionnaire.item.enableWhen.answer

ImplementationGuide.definition.page.page.name
type: ObjectProperty

TerminologyCapabilities.codeSystem.version
type: ObjectProperty
comment: For the code system, a list of versions that are supported by the server.
domain: TerminologyCapabilitiesCodeSystemComponent
range: TerminologyCapabilitiesCodeSystemComponent.TerminologyCapabilitiesCodeSystemVersionComponent
title: Version of Code System supported

MedicinalProductPackaged.packageItem.packageItem.quantity
type: ObjectProperty
comment: The quantity of this package in the medicinal product, at the current level of packaging. The outermost is always 1.
domain: MedicinalProductPackagedPackageItemComponentPackageItem
range: Quantity
title: The quantity of this package in the medicinal product, at the current level of packaging. The outermost is always 1

Procedure.performedDateTime
type: ObjectProperty
domain: Procedure
range: dateTime
sub property of: Procedure.performed

ServiceRequest.requester
type: ObjectProperty
comment: The individual who initiated the request and has responsibility for its activation.
domain: ServiceRequest
range: Reference
sub property of: who.author
title: Who/what is requesting service

OperationDefinition.parameter.binding.strength
type: ObjectProperty
comment: Indicates the degree of conformance expectations associated with this binding - that is, the degree to which the provided value set must be adhered to in the instances.
domain: OperationDefinitionParameterComponent.OperationDefinitionParameterBindingComponent
range: code
title: required | extensible | preferred | example

Coverage.copay.value
type: ObjectProperty
comment: The amount of patient payments for various types of services/products, expressed as a percentage of the service/product cost or a fixed amount of currency.
domain: Coverage.CoPayComponent
range: Quantity
title: The amount or percentage of the copayment

Communication.partOf
type: ObjectProperty
comment: Part of this action.
domain: Communication
range: Reference
title: Part of this action

Medication.batch
type: ObjectProperty
comment: Information that only applies to packages (not products).
domain: Medication
range: MedicationBatchComponent
title: Details about packaged medications

RequestGroup.identifier
type: ObjectProperty
comment: Allows a service to provide a unique, business identifier for the request.
domain: RequestGroup
range: Identifier
sub property of: id
title: Business identifier

Attachment.hash
type: ObjectProperty
comment: The calculated hash of the data using SHA-1. Represented using base64.
domain: Attachment
range: base64Binary
title: Hash of the data (sha-1, base64ed)

ExampleScenario.process.step.alternative.option.description
type: ObjectProperty
comment: A human-readable description of each option.
domain: ExampleScenarioProcessComponent.ExampleScenarioProcessStepComponent.ExampleScenarioProcessStepAlternativeComponent.ExampleScenarioProcessStepAlternativeOptionComponent
range: markdown
title: A human-readable description of each option

Observation.issued
type: ObjectProperty
comment: The date and time this version of the observation was made available to providers, typically after the results have been reviewed and verified.
domain: Observation
range: instant
sub property of: when.recorded
title: Date/Time this version was made available

DeviceRequest.occurrence
type: ObjectProperty

DiagnosticReport.status
type: ObjectProperty
comment: The status of the diagnostic report.
domain: DiagnosticReport
range: code
sub property of: status
title: registered | partial | preliminary | final +

MessageHeader.source
type: ObjectProperty
comment: The source application from which this message originated.
domain: MessageHeader
range: MessageHeader.MessageSourceComponent
sub property of: who.actor
title: Message source application

ExampleScenario.process.step.process.step.operation.response.versionId
type: ObjectProperty
comment: A specific version of a resource contained in the instance.
domain: ExampleScenarioProcessComponent.ExampleScenarioProcessStepComponentProcess.ExampleScenarioProcessStepComponent.ExampleScenarioProcessStepOperationComponentContainedInstance
range: string
title: A specific version of a resource contained in the instance

CoverageEligibilityResponse.disposition
type: ObjectProperty
comment: A description of the status of the adjudication.
domain: CoverageEligibilityResponse
range: string
title: Disposition Message

DetectedIssue.mitigation.action
type: ObjectProperty
comment: Describes the action that was taken or the observation that was made that reduces/eliminates the risk associated with the identified issue.
domain: DetectedIssueMitigationComponent
range: CodeableConcept
title: What mitigation?

Organization.partOf
type: ObjectProperty
comment: The organization of which this organization forms a part.
domain: Organization
range: Reference
title: The organization of which this organization forms a part

Account.subject
type: ObjectProperty
comment: Identifies the patient, device, practitioner, location or other object the account is associated with.
domain: Account
range: Reference
sub property of: who.focus
title: What is account tied to?

Condition.onsetAge
type: ObjectProperty
domain: Condition
range: Age
sub property of: Condition.onset

MedicinalProductContraindication.disease
type: ObjectProperty
comment: The disease, symptom or procedure for the contraindication.
domain: MedicinalProductContraindication
range: CodeableConcept
title: The disease, symptom or procedure for the contraindication

CodeSystem.useContext
type: ObjectProperty
comment: The content was developed with a focus and intent of supporting the contexts that are listed. These terms may be used to assist with indexing and searching for appropriate code system instances.
domain: CodeSystem
range: UsageContext
title: The context that the content is intended to support

QuestionnaireResponse.item.text
type: ObjectProperty
comment: Text that is displayed above the contents of the group or as the text of the question being answered.
domain: QuestionnaireResponseItemComponent
range: string
title: Name for group or question text

MedicinalProductAuthorizationJurisdictionalAuthorizationComponent
type: Class
comment: Authorization in areas within a country.
subclass of: BackboneElement
subclass of: Restriction
  all values from: Period
  max cardinality: 1
  on property: MedicinalProductAuthorization.jurisdictionalAuthorization.validityPeriod
subclass of: Restriction
  all values from: CodeableConcept
  max cardinality: 1
  on property: MedicinalProductAuthorization.jurisdictionalAuthorization.legalStatusOfSupply
subclass of: Restriction
  all values from: CodeableConcept
  on property: MedicinalProductAuthorization.jurisdictionalAuthorization.jurisdiction
subclass of: Restriction
  all values from: CodeableConcept
  max cardinality: 1
  on property: MedicinalProductAuthorization.jurisdictionalAuthorization.country
subclass of: Restriction
  all values from: Identifier
  on property: MedicinalProductAuthorization.jurisdictionalAuthorization.identifier

SubstanceSpecification.structure.stereochemistry
type: ObjectProperty
comment: Stereochemistry type.
domain: SubstanceSpecificationStructureComponent
range: CodeableConcept
title: Stereochemistry type

CoverageEligibilityRequest.insurance.businessArrangement
type: ObjectProperty
comment: The contract number of a business agreement which describes the terms and conditions.
domain: CoverageEligibilityRequest.InsuranceComponent
range: string
title: Business agreement

ActivityDefinition.date
type: ObjectProperty
comment: The date (and optionally time) when the activity definition was published. The date must change when the business version changes and it must change if the status code changes. In addition, it should change when the substantive content of the activity definition changes.
domain: ActivityDefinition
range: dateTime
sub property of: when.recorded
title: Date last changed

ChargeItem.account
type: ObjectProperty
comment: Account into which this ChargeItems belongs.
domain: ChargeItem
range: Reference
title: Account to place this charge

TestScript.test.action.assert.rule.param.value
type: ObjectProperty
comment: The value for the parameter that will be passed on to the external rule template.
domain: TestScriptTestComponent.TestActionComponentAssert.ActionAssertRuleComponent.ActionAssertRuleParamComponent
range: string
title: Parameter value defined either explicitly or dynamically

DeviceDefinition.capability
type: ObjectProperty
comment: Device capabilities.
domain: DeviceDefinition
range: DeviceDefinitionCapabilityComponent
title: Device capabilities

PersonLinkComponent
type: Class
comment: Link to a resource that concerns the same actual person.
subclass of: BackboneElement
subclass of: Restriction
  all values from: code
  max cardinality: 1
  on property: Person.link.assurance
subclass of: Restriction
  cardinality: 1
  on property: Person.link.target
  some values from: Reference

Encounter.hospitalization.origin
type: ObjectProperty
comment: The location/organization from which the patient came before admission.
domain: EncounterHospitalizationComponent
range: Reference
title: The location/organization from which the patient came before admission

Encounter.hospitalization.destination
type: ObjectProperty
comment: Location/organization to which the patient is discharged.
domain: EncounterHospitalizationComponent
range: Reference
title: Location/organization to which the patient is discharged

CapabilityStatement.document.documentation
type: ObjectProperty
comment: A description of how the application supports or uses the specified document profile. For example, when documents are created, what action is taken with consumed documents, etc.
domain: CapabilityStatementDocumentComponent
range: markdown
title: Description of document support

DataRequirement.dateFilter
type: ObjectProperty
comment: Date filters specify additional constraints on the data in terms of the applicable date range for specific elements. Each date filter specifies an additional constraint on the data, i.e. date filters are AND'ed, not OR'ed.
domain: DataRequirement
range: DataRequirementDateFilterComponent
title: What dates/date ranges are expected

Consent.provisionComponent.provisionDataComponent
type: Class
comment: The resources controlled by this rule if specific resources are referenced.
subclass of: BackboneElement
subclass of: Restriction
  cardinality: 1
  on property: Consent.provision.data.reference
  some values from: Reference
subclass of: Restriction
  cardinality: 1
  on property: Consent.provision.data.meaning
  some values from: code

RequestGroup.action.precheckBehavior
type: ObjectProperty
comment: Defines whether the action should usually be preselected.
domain: RequestGroupActionComponent
range: code
title: yes | no

InsurancePlan.identifier
type: ObjectProperty
comment: Business identifiers assigned to this health insurance product which remain constant as the resource is updated and propagates from server to server.
domain: InsurancePlan
range: Identifier
sub property of: id
title: Business Identifier for Product

CodeSystem.concept.concept.property
type: ObjectProperty
comment: A property value for this concept.
domain: CodeSystem.ConceptDefinitionComponentConcept
range: CodeSystem.ConceptDefinitionComponentConcept.ConceptPropertyComponent
title: Property value for the concept

TerminologyCapabilitiesExpansionComponent
type: Class
comment: Information about the [ValueSet/$expand](valueset-operation-expand.html) operation.
subclass of: BackboneElement
subclass of: Restriction
  all values from: markdown
  max cardinality: 1
  on property: TerminologyCapabilities.expansion.textFilter
subclass of: Restriction
  all values from: TerminologyCapabilitiesExpansionComponent.TerminologyCapabilitiesExpansionParameterComponent
  on property: TerminologyCapabilities.expansion.parameter
subclass of: Restriction
  all values from: boolean
  max cardinality: 1
  on property: TerminologyCapabilities.expansion.incomplete
subclass of: Restriction
  all values from: boolean
  max cardinality: 1
  on property: TerminologyCapabilities.expansion.paging
subclass of: Restriction
  all values from: boolean
  max cardinality: 1
  on property: TerminologyCapabilities.expansion.hierarchical

ClaimResponse.item.adjudication.value
type: ObjectProperty
comment: A non-monetary value for example a percentage. Mutually exclusive to the amount element above.
domain: ClaimResponse.ItemComponent.AdjudicationComponent
range: decimal
title: Non-monetary value

Contract.domain
type: ObjectProperty
comment: Recognized governance framework or system operating with a circumscribed scope in accordance with specified principles, policies, processes or procedures for managing rights, actions, or behaviors of parties or principals relative to resources.
domain: Contract
range: Reference
title: A sphere of control governed by an authoritative jurisdiction, organization, or person

BiologicallyDerivedProduct.processing.time
type: ObjectProperty

DataRequirementCodeFilterComponent
type: Class
comment: Code filters specify additional constraints on the data, specifying the value set of interest for a particular element of the data. Each code filter defines an additional constraint on the data, i.e. code filters are AND'ed, not OR'ed.
subclass of: Element
subclass of: Restriction
  all values from: Coding
  on property: DataRequirement.codeFilter.code
subclass of: Restriction
  all values from: canonical
  max cardinality: 1
  on property: DataRequirement.codeFilter.valueSet
subclass of: Restriction
  all values from: string
  max cardinality: 1
  on property: DataRequirement.codeFilter.searchParam
subclass of: Restriction
  all values from: string
  max cardinality: 1
  on property: DataRequirement.codeFilter.path

ImplementationGuide.definition.page.title
type: ObjectProperty
comment: A short title used to represent this page in navigational structures such as table of contents, bread crumbs, etc.
domain: ImplementationGuideDefinitionComponent.ImplementationGuideDefinitionPageComponent
range: string
title: Short title shown for navigational assistance

Library.reviewer
type: ObjectProperty
comment: An individual or organization primarily responsible for review of some aspect of the content.
domain: Library
range: ContactDetail
title: Who reviewed the content

Contract.term.group.asset.answer.valueString
type: ObjectProperty
domain: Contract.TermComponentTerm.ContractAssetComponentAnswer
range: string
sub property of: Contract.term.group.asset.answer.value

MedicinalProductAuthorization.procedure.application.date
type: ObjectProperty

PlanDefinition.purpose
type: ObjectProperty
comment: Explanation of why this plan definition is needed and why it has been designed as it has.
domain: PlanDefinition
range: markdown
sub property of: why
title: Why this plan definition is defined

TestScript.setup.action
type: ObjectProperty
comment: Action would contain either an operation or an assertion.
domain: TestScriptSetupComponent
range: TestScriptSetupComponent.SetupActionComponent
title: A setup operation or assert to perform

Claim.careTeam.qualification
type: ObjectProperty
comment: The qualification which is applicable for this service.
domain: Claim.CareTeamComponent
range: CodeableConcept
title: Type, classification or Specialization

OperationDefinition.type
type: ObjectProperty
comment: Indicates whether this operation or named query can be invoked at the resource type level for any given resource type level (e.g. without needing to choose a specific resource id for the context).
domain: OperationDefinition
range: boolean
title: Invoke at the type level?

DocumentManifest.description
type: ObjectProperty
comment: Human-readable description of the source document. This is sometimes known as the "title".
domain: DocumentManifest
range: string
title: Human-readable description (title)

Sequence.structureVariant.reportedaCGHRatio
type: ObjectProperty
comment: Structural Variant reported aCGH ratio.
domain: SequenceStructureVariantComponent
range: decimal
title: Structural Variant reported aCGH ratio

ExplanationOfBenefit.addItem.detail.noteNumber
type: ObjectProperty
comment: A list of note references to the notes provided below.
domain: ExplanationOfBenefit.AddedItemComponent.AddedItemDetailComponent
range: positiveInt
title: List of note numbers which apply

Specimen.processing.timeDateTime
type: ObjectProperty
domain: SpecimenProcessingComponent
range: dateTime
sub property of: Specimen.processing.time

StructureDefinitionMappingComponent
type: Class
comment: An external specification that the content is mapped to.
subclass of: BackboneElement
subclass of: Restriction
  all values from: string
  max cardinality: 1
  on property: StructureDefinition.mapping.comment
subclass of: Restriction
  all values from: string
  max cardinality: 1
  on property: StructureDefinition.mapping.name
subclass of: Restriction
  all values from: uri
  max cardinality: 1
  on property: StructureDefinition.mapping.uri
subclass of: Restriction
  cardinality: 1
  on property: StructureDefinition.mapping.identity
  some values from: id

SubstanceSpecificationStructureComponent.SubstanceSpecificationStructureIsotopeComponent
type: Class
comment: Applicable for single substances that contain a radionuclide or a non-natural isotopic ratio.
subclass of: BackboneElement
subclass of: Restriction
  all values from: SubstanceSpecificationStructureComponent.SubstanceSpecificationStructureIsotopeComponent.SubstanceSpecificationStructureIsotopeMolecularWeightComponent
  max cardinality: 1
  on property: SubstanceSpecification.structure.isotope.molecularWeight
subclass of: Restriction
  all values from: Identifier
  max cardinality: 1
  on property: SubstanceSpecification.structure.isotope.nuclideId
subclass of: Restriction
  all values from: CodeableConcept
  max cardinality: 1
  on property: SubstanceSpecification.structure.isotope.substitutionType
subclass of: Restriction
  all values from: CodeableConcept
  max cardinality: 1
  on property: SubstanceSpecification.structure.isotope.nuclideName
subclass of: Restriction
  all values from: string
  max cardinality: 1
  on property: SubstanceSpecification.structure.isotope.amount
subclass of: Restriction
  all values from: Quantity
  max cardinality: 1
  on property: SubstanceSpecification.structure.isotope.nuclideHalfLife

EntryDefinition.identifier
type: ObjectProperty
comment: Used in supporting different identifiers for the same product, e.g. manufacturer code and retailer code.
domain: EntryDefinition
range: Identifier
title: Unique identifier of the catalog item

ConceptMap.targetCanonical
type: ObjectProperty
domain: ConceptMap
range: canonical
sub property of: ConceptMap.target

MedicationKnowledge.administrationGuidelines
type: ObjectProperty
comment: Guidelines for the administration of the medication.
domain: MedicationKnowledge
range: MedicationKnowledgeAdministrationGuidelinesComponent
title: Gudelines for administration of the medication

InsurancePlan.ownedBy
type: ObjectProperty
comment: The entity that is providing the health insurance product and underwriting the risk. This is typically an insurance carriers, other third-party payers, or health plan sponsors comonly referred to as 'payers'.
domain: InsurancePlan
range: Reference
title: Plan issuer

MedicationAdministration.dosage.rate
type: ObjectProperty

AllergyIntolerance.reaction.substance
type: ObjectProperty
comment: Identification of the specific substance (or pharmaceutical product) considered to be responsible for the Adverse Reaction event. Note: the substance for a specific reaction may be different from the substance identified as the cause of the risk, but it must be consistent with it. For instance, it may be a more specific substance (e.g. a brand medication) or a composite product that includes the identified substance. It must be clinically safe to only process the 'code' and ignore the 'reaction.substance'. If a receiving system is unable to confirm that AllergyIntolerance.reaction.substance falls within the semantic scope of AllergyIntolerance.code, then the receiving system should ignore AllergyIntolerance.reaction.substance.
domain: AllergyIntoleranceReactionComponent
range: CodeableConcept
title: Specific substance or pharmaceutical product considered to be responsible for event

CodeSystem
type: Class
comment: The CodeSystem resource is used to declare the existence of and describe a code system or code system supplement and its key properties, and optionally define a part or all of its content.
subclass of: DomainResource
subclass of: conformance.terminology
subclass of: Restriction
  all values from: Identifier
  on property: CodeSystem.identifier
subclass of: Restriction
  all values from: boolean
  max cardinality: 1
  on property: CodeSystem.versionNeeded
subclass of: Restriction
  all values from: UsageContext
  on property: CodeSystem.useContext
subclass of: Restriction
  all values from: code
  max cardinality: 1
  on property: CodeSystem.hierarchyMeaning
subclass of: Restriction
  all values from: CodeSystem.PropertyComponent
  on property: CodeSystem.property
subclass of: Restriction
  all values from: string
  max cardinality: 1
  on property: CodeSystem.publisher
subclass of: Restriction
  all values from: CodeSystemFilterComponent
  on property: CodeSystem.filter
subclass of: Restriction
  all values from: unsignedInt
  max cardinality: 1
  on property: CodeSystem.count
subclass of: Restriction
  all values from: string
  max cardinality: 1
  on property: CodeSystem.title
subclass of: Restriction
  all values from: ContactDetail
  on property: CodeSystem.contact
subclass of: Restriction
  all values from: markdown
  max cardinality: 1
  on property: CodeSystem.copyright
subclass of: Restriction
  all values from: boolean
  max cardinality: 1
  on property: CodeSystem.caseSensitive
subclass of: Restriction
  cardinality: 1
  on property: CodeSystem.content
  some values from: code
subclass of: Restriction
  all values from: CodeableConcept
  on property: CodeSystem.jurisdiction
subclass of: Restriction
  all values from: dateTime
  max cardinality: 1
  on property: CodeSystem.date
subclass of: Restriction
  cardinality: 1
  on property: CodeSystem.status
  some values from: code
subclass of: Restriction
  all values from: boolean
  max cardinality: 1
  on property: CodeSystem.experimental
subclass of: Restriction
  all values from: canonical
  max cardinality: 1
  on property: CodeSystem.supplements
subclass of: Restriction
  all values from: markdown
  max cardinality: 1
  on property: CodeSystem.purpose
subclass of: Restriction
  all values from: CodeSystem.ConceptDefinitionComponent
  on property: CodeSystem.concept
subclass of: Restriction
  all values from: string
  max cardinality: 1
  on property: CodeSystem.name
subclass of: Restriction
  all values from: string
  max cardinality: 1
  on property: CodeSystem.version
subclass of: Restriction
  all values from: uri
  max cardinality: 1
  on property: CodeSystem.url
subclass of: Restriction
  all values from: boolean
  max cardinality: 1
  on property: CodeSystem.compositional
subclass of: Restriction
  all values from: markdown
  max cardinality: 1
  on property: CodeSystem.description
subclass of: Restriction
  all values from: canonical
  max cardinality: 1
  on property: CodeSystem.valueSet

StructureMap.copyright
type: ObjectProperty
comment: A copyright statement relating to the structure map and/or its contents. Copyright statements are generally legal restrictions on the use and publishing of the structure map.
domain: StructureMap
range: markdown
title: Use and/or publishing restrictions

ExampleScenarioInstanceComponent.ExampleScenarioInstanceContainedInstanceComponent
type: Class
comment: Resources contained in the instance (e.g. the observations contained in a bundle).
subclass of: BackboneElement
subclass of: Restriction
  all values from: string
  max cardinality: 1
  on property: ExampleScenario.instance.containedInstance.versionId
subclass of: Restriction
  cardinality: 1
  on property: ExampleScenario.instance.containedInstance.resourceId
  some values from: string

ElementDefinition.min
type: ObjectProperty
comment: The minimum number of times this element SHALL appear in the instance.
domain: ElementDefinition
range: unsignedInt
title: Minimum Cardinality

DeviceUseStatement.status
type: ObjectProperty
comment: A code representing the patient or other source's judgment about the state of the device used that this statement is about. Generally this will be active or completed.
domain: DeviceUseStatement
range: code
sub property of: status
title: active | completed | entered-in-error +

ObservationComponentComponent
type: Class
comment: Some observations have multiple component observations. These component observations are expressed as separate code value pairs that share the same attributes. Examples include systolic and diastolic component observations for blood pressure measurement and multiple component observations for genetics observations.
subclass of: BackboneElement
subclass of: Restriction
  all values from: ObservationComponentComponentReferenceRange
  on property: Observation.component.referenceRange
subclass of: Restriction
  all values from: CodeableConcept
  on property: Observation.component.interpretation
subclass of: Restriction
  all values from: CodeableConcept
  max cardinality: 1
  on property: Observation.component.dataAbsentReason
subclass of:
  union of: Restriction
    all values from: Quantity
    max cardinality: 1
    on property: Observation.component.valueQuantity
  union of: Restriction
    all values from: CodeableConcept
    max cardinality: 1
    on property: Observation.component.valueCodeableConcept
  union of: Restriction
    all values from: string
    max cardinality: 1
    on property: Observation.component.valueString
  union of: Restriction
    all values from: boolean
    max cardinality: 1
    on property: Observation.component.valueBoolean
  union of: Restriction
    all values from: integer
    max cardinality: 1
    on property: Observation.component.valueInteger
  union of: Restriction
    all values from: Range
    max cardinality: 1
    on property: Observation.component.valueRange
  union of: Restriction
    all values from: Ratio
    max cardinality: 1
    on property: Observation.component.valueRatio
  union of: Restriction
    all values from: SampledData
    max cardinality: 1
    on property: Observation.component.valueSampledData
  union of: Restriction
    all values from: time
    max cardinality: 1
    on property: Observation.component.valueTime
  union of: Restriction
    all values from: dateTime
    max cardinality: 1
    on property: Observation.component.valueDateTime
  union of: Restriction
    all values from: Period
    max cardinality: 1
    on property: Observation.component.valuePeriod
subclass of: Restriction
  cardinality: 1
  on property: Observation.component.code
  some values from: CodeableConcept

TestScript.rule.resource
type: ObjectProperty
comment: Reference to the resource (containing the contents of the rule needed for assertions).
domain: TestScriptRuleComponent
range: Reference
title: Assert rule resource reference

CommunicationRequest.occurrenceDateTime
type: ObjectProperty
domain: CommunicationRequest
range: dateTime
sub property of: CommunicationRequest.occurrence

Bundle.entry.response
type: ObjectProperty
comment: Indicates the results of processing the corresponding 'request' entry in the batch or transaction being responded to or what the results of an operation where when returning history.
domain: BundleEntryComponent
range: BundleEntryComponent.BundleEntryResponseComponent
title: Results of execution (transaction/batch/history)

SearchParameter.purpose
type: ObjectProperty
comment: Explanation of why this search parameter is needed and why it has been designed as it has.
domain: SearchParameter
range: markdown
sub property of: why
title: Why this search parameter is defined

Claim.accident.locationAddress
type: ObjectProperty
domain: Claim.AccidentComponent
range: Address
sub property of: Claim.accident.location

BiologicallyDerivedProduct.collection.collectedPeriod
type: ObjectProperty
domain: BiologicallyDerivedProductCollectionComponent
range: Period
sub property of: BiologicallyDerivedProduct.collection.collected

SubstanceReferenceInformation.relationship.relationship
type: ObjectProperty
comment: Todo.
domain: SubstanceReferenceInformationRelationshipComponent
range: CodeableConcept
title: Todo

MessageHeader.sender
type: ObjectProperty
comment: Identifies the sending system to allow the use of a trust relationship.
domain: MessageHeader
range: Reference
sub property of: who.focus
title: Real world sender of the message

SubstanceSpecification.structure.isotope.nuclideName
type: ObjectProperty
comment: Substance name for each non-natural or radioisotope.
domain: SubstanceSpecificationStructureComponent.SubstanceSpecificationStructureIsotopeComponent
range: CodeableConcept
title: Substance name for each non-natural or radioisotope

ChargeItemDefinition.useContext
type: ObjectProperty
comment: The content was developed with a focus and intent of supporting the contexts that are listed. These terms may be used to assist with indexing and searching for appropriate charge item definition instances.
domain: ChargeItemDefinition
range: UsageContext
title: The context that the content is intended to support

Practitioner.name
type: ObjectProperty
comment: The name(s) associated with the practitioner.
domain: Practitioner
range: HumanName
title: The name(s) associated with the practitioner

RiskAssessment.condition
type: ObjectProperty
comment: For assessments or prognosis specific to a particular condition, indicates the condition being assessed.
domain: RiskAssessment
range: Reference
title: Condition assessed

TestScript.test.action.operation.sourceId
type: ObjectProperty
comment: The id of the fixture used as the body of a PUT or POST request.
domain: TestScriptTestComponent.TestActionComponentOperation
range: id
title: Fixture Id of body for PUT and POST requests

Endpoint.address
type: ObjectProperty
comment: The uri that describes the actual end-point to connect to.
domain: Endpoint
range: url
title: The technical base address for connecting to this endpoint

ValueSetComposeComponentInclude.ConceptReferenceComponent.ConceptReferenceDesignationComponent
type: Class
comment: Additional representations for this concept when used in this value set - other languages, aliases, specialized purposes, used for particular purposes, etc.
subclass of: BackboneElement
subclass of: Restriction
  cardinality: 1
  on property: ValueSet.compose.exclude.concept.designation.value
  some values from: string
subclass of: Restriction
  all values from: Coding
  max cardinality: 1
  on property: ValueSet.compose.exclude.concept.designation.use
subclass of: Restriction
  all values from: code
  max cardinality: 1
  on property: ValueSet.compose.exclude.concept.designation.language

StructureMapGroupComponent.StructureMapGroupInputComponent
type: Class
comment: A name assigned to an instance of data. The instance must be provided when the mapping is invoked.
subclass of: BackboneElement
subclass of: Restriction
  all values from: string
  max cardinality: 1
  on property: StructureMap.group.input.documentation
subclass of: Restriction
  cardinality: 1
  on property: StructureMap.group.input.mode
  some values from: code
subclass of: Restriction
  all values from: string
  max cardinality: 1
  on property: StructureMap.group.input.type
subclass of: Restriction
  cardinality: 1
  on property: StructureMap.group.input.name
  some values from: id

Practitioner.identifier
type: ObjectProperty
comment: An identifier that applies to this person in this role.
domain: Practitioner
range: Identifier
sub property of: id
title: An identifier for the person as this agent

SubstanceReferenceInformation.relationship.amountType
type: ObjectProperty
comment: Todo.
domain: SubstanceReferenceInformationRelationshipComponent
range: CodeableConcept
title: Todo

UserSession.user
type: ObjectProperty
comment: A practitioner, patient, device, or related person engaged in the session.
domain: UserSession
range: Reference
title: User engaged in the session

SupplyRequest
type: Class
comment: A record of a request for a medication, substance or device used in the healthcare setting.
subclass of: DomainResource
subclass of: workflow.order
subclass of: Restriction
  all values from: Identifier
  max cardinality: 1
  on property: SupplyRequest.identifier
subclass of: Restriction
  all values from: Reference
  on property: SupplyRequest.reasonReference
subclass of: Restriction
  all values from: Reference
  max cardinality: 1
  on property: SupplyRequest.requester
subclass of:
  union of: Restriction
    cardinality: 1
    on property: SupplyRequest.itemCodeableConcept
    some values from: CodeableConcept
  union of: Restriction
    cardinality: 1
    on property: SupplyRequest.itemReference
    some values from: Reference
subclass of: Restriction
  all values from: CodeableConcept
  max cardinality: 1
  on property: SupplyRequest.category
subclass of: Restriction
  all values from: CodeableConcept
  on property: SupplyRequest.reasonCode
subclass of: Restriction
  all values from: dateTime
  max cardinality: 1
  on property: SupplyRequest.authoredOn
subclass of:
  union of: Restriction
    all values from: dateTime
    max cardinality: 1
    on property: SupplyRequest.occurrenceDateTime
  union of: Restriction
    all values from: Period
    max cardinality: 1
    on property: SupplyRequest.occurrencePeriod
  union of: Restriction
    all values from: Timing
    max cardinality: 1
    on property: SupplyRequest.occurrenceTiming
subclass of: Restriction
  cardinality: 1
  on property: SupplyRequest.quantity
  some values from: Quantity
subclass of: Restriction
  all values from: code
  max cardinality: 1
  on property: SupplyRequest.status
subclass of: Restriction
  all values from: Reference
  on property: SupplyRequest.supplier
subclass of: Restriction
  all values from: Reference
  max cardinality: 1
  on property: SupplyRequest.deliverFrom
subclass of: Restriction
  all values from: SupplyRequestParameterComponent
  on property: SupplyRequest.parameter
subclass of: Restriction
  all values from: code
  max cardinality: 1
  on property: SupplyRequest.priority
subclass of: Restriction
  all values from: Reference
  max cardinality: 1
  on property: SupplyRequest.deliverTo

ConceptMap.group.element
type: ObjectProperty
comment: Mappings for an individual concept in the source to one or more concepts in the target.
domain: ConceptMapGroupComponent
range: ConceptMapGroupComponent.SourceElementComponent
title: Mappings for a concept from the source set

DocumentReference.description
type: ObjectProperty
comment: Human-readable description of the source document.
domain: DocumentReference
range: string
title: Human-readable description

MedicationStatement.medication
type: ObjectProperty

StructureDefinition.purpose
type: ObjectProperty
comment: Explanation of why this structure definition is needed and why it has been designed as it has.
domain: StructureDefinition
range: markdown
sub property of: why
title: Why this structure definition is defined

GuidanceResponse.requestIdentifier
type: ObjectProperty
comment: The identifier of the request associated with this response. If an identifier was given as part of the request, it will be reproduced here to enable the requester to more easily identify the response in a multi-request scenario.
domain: GuidanceResponse
range: Identifier
title: The identifier of the request associated with this response, if any

MedicationKnowledge.ingredient.itemReference
type: ObjectProperty
domain: MedicationKnowledgeIngredientComponent
range: Reference
sub property of: MedicationKnowledge.ingredient.item

CapabilityStatement.rest.resource.interaction.code
type: ObjectProperty
comment: Coded identifier of the operation, supported by the system resource.
domain: CapabilityStatementRestComponent.CapabilityStatementRestResourceComponent.ResourceInteractionComponent
range: code
title: read | vread | update | patch | delete | history-instance | history-type | create | search-type

ExampleScenario.process.step.operation.number
type: ObjectProperty
comment: The sequential number of the interaction, e.g. 1.2.5.
domain: ExampleScenarioProcessComponent.ExampleScenarioProcessStepComponent.ExampleScenarioProcessStepOperationComponent
range: string
title: The sequential number of the interaction

CapabilityStatement.rest.resource.operation.documentation
type: ObjectProperty
comment: Documentation that describes anything special about the operation behavior, possibly detailing different behavior for system, type and instance-level invocation of the operation.
domain: CapabilityStatementRestComponent.CapabilityStatementRestResourceComponent.CapabilityStatementRestResourceOperationComponent
range: markdown
title: Specific details about operation behavior

CodeSystem.ConceptDefinitionComponent.ConceptPropertyComponent
type: Class
comment: A property value for this concept.
subclass of: BackboneElement
subclass of:
  union of: Restriction
    cardinality: 1
    on property: CodeSystem.concept.property.valueCode
    some values from: code
  union of: Restriction
    cardinality: 1
    on property: CodeSystem.concept.property.valueCoding
    some values from: Coding
  union of: Restriction
    cardinality: 1
    on property: CodeSystem.concept.property.valueString
    some values from: string
  union of: Restriction
    cardinality: 1
    on property: CodeSystem.concept.property.valueInteger
    some values from: integer
  union of: Restriction
    cardinality: 1
    on property: CodeSystem.concept.property.valueBoolean
    some values from: boolean
  union of: Restriction
    cardinality: 1
    on property: CodeSystem.concept.property.valueDateTime
    some values from: dateTime
  union of: Restriction
    cardinality: 1
    on property: CodeSystem.concept.property.valueDecimal
    some values from: decimal
subclass of: Restriction
  cardinality: 1
  on property: CodeSystem.concept.property.code
  some values from: code

Sequence.structureVariant.outer
type: ObjectProperty
comment: Structural variant outer.
domain: SequenceStructureVariantComponent
range: SequenceStructureVariantComponent.SequenceStructureVariantOuterComponent
title: Structural variant outer

OperationOutcomeIssueComponent
type: Class
comment: An error, warning or information message that results from a system action.
subclass of: BackboneElement
subclass of: Restriction
  all values from: string
  on property: OperationOutcome.issue.expression
subclass of: Restriction
  all values from: CodeableConcept
  max cardinality: 1
  on property: OperationOutcome.issue.details
subclass of: Restriction
  all values from: string
  max cardinality: 1
  on property: OperationOutcome.issue.diagnostics
subclass of: Restriction
  cardinality: 1
  on property: OperationOutcome.issue.severity
  some values from: code
subclass of: Restriction
  cardinality: 1
  on property: OperationOutcome.issue.code
  some values from: code
subclass of: Restriction
  all values from: string
  on property: OperationOutcome.issue.location

PlanDefinition.action.participant
type: ObjectProperty
comment: Indicates who should participate in performing the action described.
domain: PlanDefinitionActionComponent
range: PlanDefinitionActionComponent.PlanDefinitionActionParticipantComponent
title: Who should participate in the action

ClaimResponse.item.detail.subDetail.adjudication.amount
type: ObjectProperty
comment: Monetary amount associated with the code.
domain: ClaimResponse.ItemComponent.ItemDetailComponent.SubDetailComponentAdjudication
range: Money
title: Monetary amount

CommunicationRequest.payload
type: ObjectProperty
comment: Text, attachment(s), or resource(s) to be communicated to the recipient.
domain: CommunicationRequest
range: CommunicationRequestPayloadComponent
title: Message payload

MedicinalProductAuthorization.subject
type: ObjectProperty
comment: The medicinal product that is being authorized.
domain: MedicinalProductAuthorization
range: Reference
title: The medicinal product that is being authorized

PlanDefinition.action.action.title
type: ObjectProperty
comment: The title of the action displayed to a user.
domain: PlanDefinitionActionComponentAction
range: string
title: User-visible title

EpisodeOfCare.status
type: ObjectProperty
comment: planned | waitlist | active | onhold | finished | cancelled.
domain: EpisodeOfCare
range: code
sub property of: status
title: planned | waitlist | active | onhold | finished | cancelled | entered-in-error

Condition.note
type: ObjectProperty
comment: Additional information about the Condition. This is a general notes/comments entry for description of the Condition, its diagnosis and prognosis.
domain: Condition
range: Annotation
title: Additional information about the Condition

MedicationKnowledge.regulatory.substitution.type
type: ObjectProperty
comment: Specifies the type of substitution allowed.
domain: MedicationKnowledgeRegulatoryComponent.MedicationKnowledgeRegulatorySubstitutionComponent
range: CodeableConcept
title: Specifies the type of substitution allowed

ImplementationGuideDefinitionComponent.ImplementationGuideDefinitionTemplateComponent
type: Class
comment: A template for building resources.
subclass of: BackboneElement
subclass of: Restriction
  all values from: string
  max cardinality: 1
  on property: ImplementationGuide.definition.template.scope
subclass of: Restriction
  cardinality: 1
  on property: ImplementationGuide.definition.template.source
  some values from: string
subclass of: Restriction
  cardinality: 1
  on property: ImplementationGuide.definition.template.code
  some values from: code

GraphDefinition.link.target.compartment.expression
type: ObjectProperty
comment: Custom rule, as a FHIRPath expression.
domain: GraphDefinitionLinkComponent.GraphDefinitionLinkTargetComponent.GraphDefinitionLinkTargetCompartmentComponent
range: string
title: Custom rule, as a FHIRPath expression

Contract.TermComponent.ActionComponent.ActionSubjectComponent
type: Class
comment: Entity of the action.
subclass of: BackboneElement
subclass of: Restriction
  all values from: CodeableConcept
  max cardinality: 1
  on property: Contract.term.action.subject.role
subclass of: Restriction
  on property: Contract.term.action.subject.reference
  some values from: Reference

Consent.provisionComponent
type: Class
comment: An exception to the base policy of this consent. An exception can be an addition or removal of access permissions.
subclass of: BackboneElement
subclass of: Restriction
  all values from: Consent.provisionComponent.provisionDataComponent
  on property: Consent.provision.data
subclass of: Restriction
  all values from: CodeableConcept
  on property: Consent.provision.code
subclass of: Restriction
  all values from: Coding
  on property: Consent.provision.securityLabel
subclass of: Restriction
  all values from: Consent.provisionComponent.provisionActorComponent
  on property: Consent.provision.actor
subclass of: Restriction
  all values from: Period
  max cardinality: 1
  on property: Consent.provision.period
subclass of: Restriction
  all values from: code
  max cardinality: 1
  on property: Consent.provision.type
subclass of: Restriction
  all values from: Period
  max cardinality: 1
  on property: Consent.provision.dataPeriod
subclass of: Restriction
  all values from: Coding
  on property: Consent.provision.purpose
subclass of: Restriction
  all values from: Consent.provisionComponentProvision
  on property: Consent.provision.provision
subclass of: Restriction
  all values from: Coding
  on property: Consent.provision.class
subclass of: Restriction
  all values from: CodeableConcept
  on property: Consent.provision.action

TestScript.setup.action.assert.compareToSourceExpression
type: ObjectProperty
comment: The FHIRPath expression to evaluate against the source fixture. When compareToSourceId is defined, either compareToSourceExpression or compareToSourcePath must be defined, but not both.
domain: TestScriptSetupComponent.SetupActionComponent.SetupActionAssertComponent
range: string
title: The FHIRPath expression to evaluate against the source fixture

MedicinalProductUndesirableEffect.frequencyOfOccurrence
type: ObjectProperty
comment: The frequency of occurrence of the effect.
domain: MedicinalProductUndesirableEffect
range: CodeableConcept
title: The frequency of occurrence of the effect

MessageHeader.author
type: ObjectProperty
comment: The logical author of the message - the person or device that decided the described event should happen. When there is more than one candidate, pick the most proximal to the MessageHeader. Can provide other authors in extensions.
domain: MessageHeader
range: Reference
sub property of: who.author
title: The source of the decision

Contract.term.group.asset.context.code
type: ObjectProperty
comment: Coded representation of the context generally or of the Referenced entity, such as the asset holder type or location.
domain: Contract.TermComponentTerm.ContractAssetComponent.AssetContextComponent
range: CodeableConcept
title: Codeable asset context

Meta.tag
type: ObjectProperty
comment: Tags applied to this resource. Tags are intended to be used to identify and relate resources to process and workflow, and applications are not required to consider the tags when interpreting the meaning of a resource.
domain: Meta
range: Coding
title: Tags applied to this resource

TestScript.test.action.operation.type
type: ObjectProperty
comment: Server interaction or operation type.
domain: TestScriptTestComponent.TestActionComponentOperation
range: Coding
title: The operation code type that will be executed

RequestGroup.author
type: ObjectProperty
comment: Provides a reference to the author of the request group.
domain: RequestGroup
range: Reference
sub property of: who.author
title: Device or practitioner that authored the request group

ElementDefinition.minValueTime
type: ObjectProperty
domain: ElementDefinition
range: time
sub property of: ElementDefinition.minValue

ExplanationOfBenefit.item.unitPrice
type: ObjectProperty
comment: If the item is a node then this is the fee for the product or service, otherwise this is the total of the fees for the children of the group.
domain: ExplanationOfBenefit.ItemComponent
range: Money
title: Fee, charge or cost per point

SubstancePolymer.repeat.repeatUnit.structuralRepresentation.attachment
type: ObjectProperty
comment: Todo.
domain: SubstancePolymerRepeatComponent.SubstancePolymerRepeatRepeatUnitComponent.SubstancePolymerRepeatRepeatUnitStructuralRepresentationComponent
range: Attachment
title: Todo

Claim.item.detail.udi
type: ObjectProperty
comment: List of Unique Device Identifiers associated with this line item.
domain: Claim.ItemComponent.DetailComponent
range: Reference
title: Unique Device Identifier

ExplanationOfBenefit.item.location
type: ObjectProperty

ExampleScenario.process.step.process.step.alternative.option.step.alternative.option.pause
type: ObjectProperty
comment: If there is a pause in the flow.
domain: ExampleScenarioProcessComponent.ExampleScenarioProcessStepComponentProcess.ExampleScenarioProcessStepComponent.ExampleScenarioProcessStepAlternativeComponent.ExampleScenarioProcessStepAlternativeOptionComponentStep.ExampleScenarioProcessStepAlternativeComponent.ExampleScenarioProcessStepAlternativeOptionComponent
range: boolean
title: If there is a pause in the flow

MedicinalProductClinicals.contraindication.therapeuticIndication.undesirableEffects.symptomConditionEffect
type: ObjectProperty
comment: The symptom, condition or undesirable effect.
domain: MedicinalProductClinicalsContraindicationComponentTherapeuticIndicationUndesirableEffects
range: CodeableConcept
title: The symptom, condition or undesirable effect

DiagnosticReport.result
type: ObjectProperty
comment: [Observations](observation.html) that are part of this diagnostic report.
domain: DiagnosticReport
range: Reference
title: Observations

MeasureReport.measure
type: ObjectProperty
comment: A reference to the Measure that was calculated to produce this report.
domain: MeasureReport
range: canonical
sub property of: what
title: What measure was calculated

RequestGroup.action.action.precheckBehavior
type: ObjectProperty
comment: Defines whether the action should usually be preselected.
domain: RequestGroupActionComponentAction
range: code
title: yes | no

MedicinalProductContraindication.population.ageRange
type: ObjectProperty
domain: MedicinalProductContraindicationPopulationComponent
range: Range
sub property of: MedicinalProductContraindication.population.age

ElementDefinition.condition
type: ObjectProperty
comment: A reference to an invariant that may make additional statements about the cardinality or value in the instance.
domain: ElementDefinition
range: id
title: Reference to invariant about presence

PlanDefinition.action.timing
type: ObjectProperty

CapabilityStatementRestComponent
type: Class
comment: A definition of the restful capabilities of the solution, if any.
subclass of: BackboneElement
subclass of: Restriction
  all values from: CapabilityStatementRestComponentSearchParam
  on property: CapabilityStatement.rest.searchParam
subclass of: Restriction
  all values from: CapabilityStatementRestComponent.SystemInteractionComponent
  on property: CapabilityStatement.rest.interaction
subclass of: Restriction
  all values from: CapabilityStatementRestComponent.CapabilityStatementRestSecurityComponent
  max cardinality: 1
  on property: CapabilityStatement.rest.security
subclass of: Restriction
  cardinality: 1
  on property: CapabilityStatement.rest.mode
  some values from: code
subclass of: Restriction
  all values from: canonical
  on property: CapabilityStatement.rest.compartment
subclass of: Restriction
  all values from: markdown
  max cardinality: 1
  on property: CapabilityStatement.rest.documentation
subclass of: Restriction
  all values from: CapabilityStatementRestComponentOperation
  on property: CapabilityStatement.rest.operation
subclass of: Restriction
  all values from: CapabilityStatementRestComponent.CapabilityStatementRestResourceComponent
  on property: CapabilityStatement.rest.resource

Specimen.container.additiveCodeableConcept
type: ObjectProperty
domain: SpecimenContainerComponent
range: CodeableConcept
sub property of: Specimen.container.additive

Location.managingOrganization
type: ObjectProperty
comment: The organization responsible for the provisioning and upkeep of the location.
domain: Location
range: Reference
title: Organization responsible for provisioning and upkeep

ConceptMap.url
type: ObjectProperty
comment: An absolute URI that is used to identify this concept map when it is referenced in a specification, model, design or an instance; also called its canonical identifier. This SHOULD be globally unique and SHOULD be a literal address at which at which an authoritative instance of this concept map is (or will be) published. This URL can be the target of a canonical reference. It SHALL remain the same when the concept map is stored on different servers.
domain: ConceptMap
range: uri
sub property of: id
title: Canonical identifier for this concept map, represented as a URI (globally unique)

RelatedPerson.address
type: ObjectProperty
comment: Address where the related person can be contacted or visited.
domain: RelatedPerson
range: Address
title: Address where the related person can be contacted or visited

AdverseEvent.resultingCondition
type: ObjectProperty
comment: Includes information about the reaction that occurred as a result of exposure to a substance (for example, a drug or a chemical).
domain: AdverseEvent
range: Reference
title: Effect on the subject due to this event

MessageHeader.enterer
type: ObjectProperty
comment: The person or device that performed the data entry leading to this message. When there is more than one candidate, pick the most proximal to the message. Can provide other enterers in extensions.
domain: MessageHeader
range: Reference
sub property of: who.author
title: The source of the data entry

CoverageEligibilityResponse.created
type: ObjectProperty
comment: The date when the enclosed suite of services were performed or completed.
domain: CoverageEligibilityResponse
range: dateTime
sub property of: when.recorded
title: Creation date

CapabilityStatement.rest.interaction.code
type: ObjectProperty
comment: A coded identifier of the operation, supported by the system.
domain: CapabilityStatementRestComponent.SystemInteractionComponent
range: code
title: transaction | batch | search-system | history-system

ExampleScenario.process.step.operation.response
type: ObjectProperty
comment: Each resource instance used by the responder.
domain: ExampleScenarioProcessComponent.ExampleScenarioProcessStepComponent.ExampleScenarioProcessStepOperationComponent
range: ExampleScenarioProcessComponent.ExampleScenarioProcessStepComponent.ExampleScenarioProcessStepOperationComponentContainedInstance
title: Each resource instance used by the responder

ImplementationGuide.definition.resource.name
type: ObjectProperty
comment: A human assigned name for the resource. All resources SHOULD have a name, but the name may be extracted from the resource (e.g. ValueSet.name).
domain: ImplementationGuideDefinitionComponent.ImplementationGuideDefinitionResourceComponent
range: string
title: Human Name for the resource

ImplementationGuide.experimental
type: ObjectProperty
comment: A Boolean value to indicate that this implementation guide is authored for testing purposes (or education/evaluation/marketing) and is not intended to be used for genuine usage.
domain: ImplementationGuide
range: boolean
sub property of: class
title: For testing purposes, not real usage

ExplanationOfBenefit.AddedItemComponent
type: Class
comment: The first-tier service adjudications for payor added services.
subclass of: BackboneElement
subclass of: Restriction
  all values from: positiveInt
  on property: ExplanationOfBenefit.addItem.subDetailSequence
subclass of: Restriction
  all values from: positiveInt
  on property: ExplanationOfBenefit.addItem.itemSequence
subclass of: Restriction
  all values from: CodeableConcept
  max cardinality: 1
  on property: ExplanationOfBenefit.addItem.billcode
subclass of: Restriction
  all values from: CodeableConcept
  on property: ExplanationOfBenefit.addItem.subSite
subclass of:
  union of: Restriction
    all values from: date
    max cardinality: 1
    on property: ExplanationOfBenefit.addItem.servicedDate
  union of: Restriction
    all values from: Period
    max cardinality: 1
    on property: ExplanationOfBenefit.addItem.servicedPeriod
subclass of: Restriction
  all values from: positiveInt
  on property: ExplanationOfBenefit.addItem.noteNumber
subclass of: Restriction
  all values from: ExplanationOfBenefit.AddedItemComponent.AddedItemDetailComponent
  on property: ExplanationOfBenefit.addItem.detail
subclass of: Restriction
  all values from: CodeableConcept
  max cardinality: 1
  on property: ExplanationOfBenefit.addItem.bodySite
subclass of: Restriction
  all values from: CodeableConcept
  on property: ExplanationOfBenefit.addItem.modifier
subclass of: Restriction
  all values from: Reference
  on property: ExplanationOfBenefit.addItem.provider
subclass of: Restriction
  all values from: SimpleQuantity
  max cardinality: 1
  on property: ExplanationOfBenefit.addItem.quantity
subclass of: Restriction
  all values from: positiveInt
  on property: ExplanationOfBenefit.addItem.detailSequence
subclass of: Restriction
  all values from: CodeableConcept
  on property: ExplanationOfBenefit.addItem.programCode
subclass of: Restriction
  all values from: decimal
  max cardinality: 1
  on property: ExplanationOfBenefit.addItem.factor
subclass of: Restriction
  all values from: Money
  max cardinality: 1
  on property: ExplanationOfBenefit.addItem.unitPrice
subclass of: Restriction
  all values from: ExplanationOfBenefit.AddedItemComponentAdjudication
  on property: ExplanationOfBenefit.addItem.adjudication
subclass of:
  union of: Restriction
    all values from: CodeableConcept
    max cardinality: 1
    on property: ExplanationOfBenefit.addItem.locationCodeableConcept
  union of: Restriction
    all values from: Address
    max cardinality: 1
    on property: ExplanationOfBenefit.addItem.locationAddress
  union of: Restriction
    all values from: Reference
    max cardinality: 1
    on property: ExplanationOfBenefit.addItem.locationReference
subclass of: Restriction
  all values from: Money
  max cardinality: 1
  on property: ExplanationOfBenefit.addItem.net

MedicationStatement.reasonReference
type: ObjectProperty
comment: Condition or observation that supports why the medication is being/was taken.
domain: MedicationStatement
range: Reference
sub property of: why
title: Condition or observation that supports why the medication is being/was taken

Annotation.time
type: ObjectProperty
comment: Indicates when this particular annotation was made.
domain: Annotation
range: dateTime
title: When the annotation was made

DataRequirementDateFilterComponent
type: Class
comment: Date filters specify additional constraints on the data in terms of the applicable date range for specific elements. Each date filter specifies an additional constraint on the data, i.e. date filters are AND'ed, not OR'ed.
subclass of: Element
subclass of:
  union of: Restriction
    all values from: dateTime
    max cardinality: 1
    on property: DataRequirement.dateFilter.valueDateTime
  union of: Restriction
    all values from: Period
    max cardinality: 1
    on property: DataRequirement.dateFilter.valuePeriod
  union of: Restriction
    all values from: Duration
    max cardinality: 1
    on property: DataRequirement.dateFilter.valueDuration
subclass of: Restriction
  all values from: string
  max cardinality: 1
  on property: DataRequirement.dateFilter.searchParam
subclass of: Restriction
  all values from: string
  max cardinality: 1
  on property: DataRequirement.dateFilter.path

GraphDefinition.link.max
type: ObjectProperty
comment: Maximum occurrences for this link.
domain: GraphDefinitionLinkComponent
range: string
title: Maximum occurrences for this link

Substance.ingredient.substanceReference
type: ObjectProperty
domain: SubstanceIngredientComponent
range: Reference
sub property of: Substance.ingredient.substance

ClaimResponse.AddedItemComponent.AddedItemDetailComponent.AddedItemSubDetailComponent
type: Class
comment: The third-tier service adjudications for payor added services.
subclass of: BackboneElement
subclass of: Restriction
  all values from: decimal
  max cardinality: 1
  on property: ClaimResponse.addItem.detail.subDetail.factor
subclass of: Restriction
  all values from: SimpleQuantity
  max cardinality: 1
  on property: ClaimResponse.addItem.detail.subDetail.quantity
subclass of: Restriction
  all values from: CodeableConcept
  max cardinality: 1
  on property: ClaimResponse.addItem.detail.subDetail.billcode
subclass of: Restriction
  all values from: Money
  max cardinality: 1
  on property: ClaimResponse.addItem.detail.subDetail.unitPrice
subclass of: Restriction
  all values from: positiveInt
  on property: ClaimResponse.addItem.detail.subDetail.noteNumber
subclass of: Restriction
  all values from: CodeableConcept
  on property: ClaimResponse.addItem.detail.subDetail.modifier
subclass of: Restriction
  all values from: Money
  max cardinality: 1
  on property: ClaimResponse.addItem.detail.subDetail.net
subclass of: Restriction
  all values from: ClaimResponse.AddedItemComponent.AddedItemDetailComponent.AddedItemSubDetailComponentAdjudication
  on property: ClaimResponse.addItem.detail.subDetail.adjudication

Subscription.tag
type: ObjectProperty
comment: A tag to add to any resource that matches the criteria, after the subscription is processed.
domain: Subscription
range: Coding
title: A tag to add to matching resources

ClaimResponse.status
type: ObjectProperty
comment: The status of the resource instance.
domain: ClaimResponse
range: code
sub property of: status
title: active | cancelled | draft | entered-in-error

ImmunizationEvaluation.seriesDoses
type: ObjectProperty

Contract.term.asset.subtype
type: ObjectProperty
comment: May be a subtype or part of an offered asset.
domain: Contract.TermComponent.ContractAssetComponent
range: CodeableConcept
title: Asset sub-category

ImplementationGuide.definition.page
type: ObjectProperty
comment: A page / section in the implementation guide. The root page is the implementation guide home page.
domain: ImplementationGuideDefinitionComponent
range: ImplementationGuideDefinitionComponent.ImplementationGuideDefinitionPageComponent
title: Page/Section in the Guide

MeasureReport.group.population
type: ObjectProperty
comment: The populations that make up the population group, one for each type of population appropriate for the measure.
domain: MeasureReportGroupComponent
range: MeasureReportGroupComponent.MeasureReportGroupPopulationComponent
title: The populations in the group

Invoice.lineItem.priceComponent.code
type: ObjectProperty
comment: A code that identifies the component. Codes may be used to differentiate between kinds of taxes, surcharges, discounts etc.
domain: InvoiceLineItemComponent.InvoiceLineItemPriceComponentComponent
range: CodeableConcept
title: Code identifying the specific component

Contract.term.group.asset.answer.valueInteger
type: ObjectProperty
domain: Contract.TermComponentTerm.ContractAssetComponentAnswer
range: integer
sub property of: Contract.term.group.asset.answer.value

MedicationKnowledge.regulatory.maxDispense
type: ObjectProperty
comment: The maximum number of units of the medicaton that can be dispensed in a period.
domain: MedicationKnowledgeRegulatoryComponent
range: MedicationKnowledgeRegulatoryComponent.MedicationKnowledgeRegulatoryMaxDispenseComponent
title: The maximum number of units of the medicaton that can be dispensed in a period

AllergyIntolerance.verificationStatus
type: ObjectProperty
comment: Assertion about certainty associated with the propensity, or potential risk, of a reaction to the identified substance (including pharmaceutical product).
domain: AllergyIntolerance
range: code
sub property of: status
title: unconfirmed | confirmed | refuted | entered-in-error

StructureMap.group.rule.dependent.name
type: ObjectProperty
comment: Name of a rule or group to apply.
domain: StructureMapGroupComponent.StructureMapGroupRuleComponent.StructureMapGroupRuleDependentComponent
range: id
title: Name of a rule or group to apply

Claim.information.valueQuantity
type: ObjectProperty
domain: Claim.SpecialConditionComponent
range: Quantity
sub property of: Claim.information.value

Device.type
type: ObjectProperty
comment: The kind or type of device.
domain: Device
range: CodeableConcept
title: The kind or type of device

DeviceRequest.requester
type: ObjectProperty
comment: The individual who initiated the request and has responsibility for its activation.
domain: DeviceRequest
range: Reference
sub property of: who.author
title: Who/what is requesting diagnostics

Claim.PayeeComponent
type: Class
comment: The party to be reimbursed for the services.
subclass of: BackboneElement
subclass of: Restriction
  all values from: Reference
  max cardinality: 1
  on property: Claim.payee.party
subclass of: Restriction
  all values from: Coding
  max cardinality: 1
  on property: Claim.payee.resource
subclass of: Restriction
  cardinality: 1
  on property: Claim.payee.type
  some values from: CodeableConcept

Patient.link.type
type: ObjectProperty
comment: The type of link between this patient resource and another patient resource.
domain: PatientLinkComponent
range: code
title: replaced-by | replaces | refer | seealso

RequestGroup.action.action.relatedAction.relationship
type: ObjectProperty
comment: The relationship of this action to the related action.
domain: RequestGroupActionComponentAction.RequestGroupActionRelatedActionComponent
range: code
title: before-start | before | before-end | concurrent-with-start | concurrent | concurrent-with-end | after-start | after | after-end

VisionPrescription.dispense.prism.amount
type: ObjectProperty
comment: Amount of prism to compensate for eye alignment in fractional units.
domain: VisionPrescriptionDispenseComponent.PrismComponent
range: decimal
title: Amount of adjustment

Contract.signer.signature
type: ObjectProperty
comment: Legally binding Contract DSIG signature contents in Base64.
domain: Contract.SignatoryComponent
range: Signature
sub property of: who.author
title: Contract Documentation Signature

DetectedIssue.mitigation.author
type: ObjectProperty
comment: Identifies the practitioner who determined the mitigation and takes responsibility for the mitigation step occurring.
domain: DetectedIssueMitigationComponent
range: Reference
title: Who is committing?

BiologicallyDerivedProduct.processing.timeDateTime
type: ObjectProperty
domain: BiologicallyDerivedProductProcessingComponent
range: dateTime
sub property of: BiologicallyDerivedProduct.processing.time

Goal.expressedBy
type: ObjectProperty
comment: Indicates whose goal this is - patient goal, practitioner goal, etc.
domain: Goal
range: Reference
sub property of: who.source
title: Who's responsible for creating Goal?

PlanDefinition.subtitle
type: ObjectProperty
comment: An explanatory or alternate title for the plan definition giving additional information about its content.
domain: PlanDefinition
range: string
title: Subordinate title of the plan definition

SpecimenDefinition.typeCollected
type: ObjectProperty
comment: The kind of material to be collected.
domain: SpecimenDefinition
range: CodeableConcept
title: Kind of material to collect

Invoice
type: Class
comment: Invoice containing collected ChargeItems from an Account with calculated individual and total price for Billing purpose.
subclass of: DomainResource
subclass of: financial.support
subclass of: Restriction
  all values from: InvoicePriceComponent
  on property: Invoice.totalPriceComponent
subclass of: Restriction
  all values from: Reference
  max cardinality: 1
  on property: Invoice.issuer
subclass of: Restriction
  all values from: Money
  max cardinality: 1
  on property: Invoice.totalGross
subclass of: Restriction
  all values from: CodeableConcept
  max cardinality: 1
  on property: Invoice.type
subclass of: Restriction
  all values from: InvoiceLineItemComponent
  on property: Invoice.lineItem
subclass of: Restriction
  all values from: Reference
  max cardinality: 1
  on property: Invoice.recipient
subclass of: Restriction
  cardinality: 1
  on property: Invoice.status
  some values from: code
subclass of: Restriction
  all values from: Annotation
  on property: Invoice.note
subclass of: Restriction
  all values from: InvoiceParticipantComponent
  on property: Invoice.participant
subclass of: Restriction
  all values from: Money
  max cardinality: 1
  on property: Invoice.totalNet
subclass of: Restriction
  all values from: Identifier
  on property: Invoice.identifier
subclass of: Restriction
  all values from: markdown
  max cardinality: 1
  on property: Invoice.paymentTerms
subclass of: Restriction
  all values from: dateTime
  max cardinality: 1
  on property: Invoice.date
subclass of: Restriction
  all values from: Reference
  max cardinality: 1
  on property: Invoice.account
subclass of: Restriction
  all values from: Reference
  max cardinality: 1
  on property: Invoice.subject
subclass of: Restriction
  all values from: string
  max cardinality: 1
  on property: Invoice.cancelledReason

MedicationAdministrationPerformerComponent
type: Class
comment: Indicates who or what performed the medication administration and how they were involved.
subclass of: BackboneElement
subclass of: Restriction
  cardinality: 1
  on property: MedicationAdministration.performer.actor
  some values from: Reference
subclass of: Restriction
  all values from: CodeableConcept
  max cardinality: 1
  on property: MedicationAdministration.performer.function

Communication.reasonCode
type: ObjectProperty
comment: The reason or justification for the communication.
domain: Communication
range: CodeableConcept
sub property of: why
title: Indication for message

Contract.LegalLanguageComponent
type: Class
comment: List of Legal expressions or representations of this Contract.
subclass of: BackboneElement
subclass of:
  union of: Restriction
    cardinality: 1
    on property: Contract.legal.contentAttachment
    some values from: Attachment
  union of: Restriction
    cardinality: 1
    on property: Contract.legal.contentReference
    some values from: Reference

Condition.verificationStatus
type: ObjectProperty
comment: The verification status to support the clinical status of the condition.
domain: Condition
range: CodeableConcept
sub property of: status
title: unconfirmed | provisional | differential | confirmed | refuted | entered-in-error

CodeSystem.purpose
type: ObjectProperty
comment: Explanation of why this code system is needed and why it has been designed as it has.
domain: CodeSystem
range: markdown
sub property of: why
title: Why this code system is defined

ElementDefinition.mapping
type: ObjectProperty
comment: Identifies a concept from an external specification that roughly corresponds to this element.
domain: ElementDefinition
range: ElementDefinitionMappingComponent
title: Map element to another set of definitions

Patient.link.other
type: ObjectProperty
comment: The other patient resource that the link refers to.
domain: PatientLinkComponent
range: Reference
title: The other patient or related person resource that the link refers to

StructureMap.group.rule.rule.target.listMode
type: ObjectProperty
comment: If field is a list, how to manage the list.
domain: StructureMapGroupComponent.StructureMapGroupRuleComponentRule.StructureMapGroupRuleTargetComponent
range: code
title: first | share | last | collate

StructureMap.status
type: ObjectProperty
comment: The status of this structure map. Enables tracking the life-cycle of the content.
domain: StructureMap
range: code
sub property of: status
title: draft | active | retired | unknown

Library.subject
type: ObjectProperty

ExampleScenario.process.step.alternative.option.step.process.step.operation.name
type: ObjectProperty
comment: The human-friendly name of the interaction.
domain: ExampleScenarioProcessComponent.ExampleScenarioProcessStepComponent.ExampleScenarioProcessStepAlternativeComponent.ExampleScenarioProcessStepAlternativeOptionComponentStepProcess.ExampleScenarioProcessStepComponent.ExampleScenarioProcessStepOperationComponent
range: string
title: The human-friendly name of the interaction

ValueSet.expansion.parameter.valueBoolean
type: ObjectProperty
domain: ValueSetExpansionComponent.ValueSetExpansionParameterComponent
range: boolean
sub property of: ValueSet.expansion.parameter.value

Claim.information.timing
type: ObjectProperty

CoverageEligibilityRequest.insurance
type: ObjectProperty
comment: Insurance policies which the patient has advised may be applicable for paying for health services.
domain: CoverageEligibilityRequest
range: CoverageEligibilityRequest.InsuranceComponent
title: Patient's Insurance or medical plan(s)

Questionnaire.purpose
type: ObjectProperty
comment: Explanation of why this questionnaire is needed and why it has been designed as it has.
domain: Questionnaire
range: markdown
sub property of: why
title: Why this questionnaire is defined

VisionPrescription.reasonCodeableConcept
type: ObjectProperty
domain: VisionPrescription
range: CodeableConcept
sub property of: VisionPrescription.reason

Contract.friendly.content
type: ObjectProperty

SubstanceSpecification.structure.structuralRepresentation.attachment
type: ObjectProperty
comment: An attached file with the structural representation.
domain: SubstanceSpecificationStructureComponent.SubstanceSpecificationStructureStructuralRepresentationComponent
range: Attachment
title: An attached file with the structural representation

TestReport.issued
type: ObjectProperty
comment: When the TestScript was executed and this TestReport was generated.
domain: TestReport
range: dateTime
sub property of: when.recorded
title: When the TestScript was executed and this TestReport was generated

ServiceRequest.bodySite
type: ObjectProperty
comment: Anatomic location where the procedure should be performed. This is the target site.
domain: ServiceRequest
range: CodeableConcept
title: Location on Body

MedicinalProductInteraction.incidence
type: ObjectProperty
comment: The incidence of the interaction.
domain: MedicinalProductInteraction
range: CodeableConcept
title: The incidence of the interaction

ExampleScenario.process.step.process.step.alternative.option.step.operation.description
type: ObjectProperty
comment: A comment to be inserted in the diagram.
domain: ExampleScenarioProcessComponent.ExampleScenarioProcessStepComponentProcess.ExampleScenarioProcessStepComponent.ExampleScenarioProcessStepAlternativeComponent.ExampleScenarioProcessStepAlternativeOptionComponentStep.ExampleScenarioProcessStepOperationComponent
range: markdown
title: A comment to be inserted in the diagram

EventDefinition.version
type: ObjectProperty
comment: The identifier that is used to identify this version of the event definition when it is referenced in a specification, model, design or instance. This is an arbitrary value managed by the event definition author and is not expected to be globally unique. For example, it might be a timestamp (e.g. yyyymmdd) if a managed version is not available. There is also no expectation that versions can be placed in a lexicographical sequence.
domain: EventDefinition
range: string
sub property of: id.version
title: Business version of the event definition

CarePlan.author
type: ObjectProperty
comment: When populated, the author is responsible for the care plan. The care plan is attributed to the author.
domain: CarePlan
range: Reference
sub property of: who.author
title: Who is the designated responsible party

CommunicationRequest.priority
type: ObjectProperty
comment: Characterizes how quickly the proposed act must be initiated. Includes concepts such as stat, urgent, routine.
domain: CommunicationRequest
range: code
sub property of: grade
title: Message urgency

Consent.provision.type
type: ObjectProperty
comment: Action to take - permit or deny - when the rule conditions are met. Not permitted in root rule, required in all nested rules.
domain: Consent.provisionComponent
range: code
title: deny | permit

ClaimResponse.item.adjudication.category
type: ObjectProperty
comment: Code indicating: Co-Pay, deductible, eligible, benefit, tax, etc.
domain: ClaimResponse.ItemComponent.AdjudicationComponent
range: CodeableConcept
title: Adjudication category such as co-pay, eligible, benefit, etc.

Condition.code
type: ObjectProperty
comment: Identification of the condition, problem or diagnosis.
domain: Condition
range: CodeableConcept
sub property of: what
title: Identification of the condition, problem or diagnosis

CoverageEligibilityResponse.insurance.item.term
type: ObjectProperty
comment: The term or period of the values such as 'maximum lifetime benefit' or 'maximum annual visits'.
domain: CoverageEligibilityResponse.InsuranceComponent.ItemsComponent
range: CodeableConcept
title: Annual or lifetime

MedicinalProductClinicals.therapeuticIndication.undesirableEffects
type: ObjectProperty
comment: Information about the use of the medicinal product in relation to other therapies as part of the indication.
domain: MedicinalProductClinicalsTherapeuticIndicationComponent
range: MedicinalProductClinicalsTherapeuticIndicationComponentUndesirableEffects
title: Information about the use of the medicinal product in relation to other therapies as part of the indication

Contract.term.group.asset.relationship
type: ObjectProperty
comment: Specifies the applicability of the term to an asset resource instance, and instances it refers to orinstances that refer to it, and/or are owned by the offeree.
domain: Contract.TermComponentTerm.ContractAssetComponent
range: Coding
title: Kinship of the asset

ClaimResponse.addItem.detail.adjudication.value
type: ObjectProperty
comment: A non-monetary value for example a percentage. Mutually exclusive to the amount element above.
domain: ClaimResponse.AddedItemComponent.AddedItemDetailComponentAdjudication
range: decimal
title: Non-monetary value

Media.createdPeriod
type: ObjectProperty
domain: Media
range: Period
sub property of: Media.created

Contract.TermComponent
type: Class
comment: One or more Contract Provisions, which may be related and conveyed as a group, and may contain nested groups.
subclass of: BackboneElement
subclass of: Restriction
  all values from: Contract.TermComponentTerm
  on property: Contract.term.group
subclass of: Restriction
  all values from: CodeableConcept
  max cardinality: 1
  on property: Contract.term.subType
subclass of: Restriction
  all values from: Contract.TermComponent.ContractAssetComponent
  on property: Contract.term.asset
subclass of: Restriction
  all values from: string
  max cardinality: 1
  on property: Contract.term.text
subclass of: Restriction
  all values from: Contract.TermComponent.ActionComponent
  on property: Contract.term.action
subclass of: Restriction
  all values from: Contract.TermComponent.SecurityLabelComponent
  on property: Contract.term.securityLabel
subclass of: Restriction
  all values from: Identifier
  max cardinality: 1
  on property: Contract.term.identifier
subclass of: Restriction
  all values from: Period
  max cardinality: 1
  on property: Contract.term.applies
subclass of:
  union of: Restriction
    all values from: CodeableConcept
    max cardinality: 1
    on property: Contract.term.topicCodeableConcept
  union of: Restriction
    all values from: Reference
    max cardinality: 1
    on property: Contract.term.topicReference
subclass of: Restriction
  all values from: dateTime
  max cardinality: 1
  on property: Contract.term.issued
subclass of: Restriction
  cardinality: 1
  on property: Contract.term.offer
  some values from: Contract.TermComponent.ContractOfferComponent
subclass of: Restriction
  all values from: CodeableConcept
  max cardinality: 1
  on property: Contract.term.type

FamilyMemberHistory
type: Class
comment: Significant health conditions for a person related to the patient relevant in the context of care for the patient.
subclass of: DomainResource
subclass of: clinical.general
subclass of: Restriction
  all values from: string
  max cardinality: 1
  on property: FamilyMemberHistory.name
subclass of: Restriction
  all values from: dateTime
  max cardinality: 1
  on property: FamilyMemberHistory.date
subclass of:
  union of: Restriction
    all values from: boolean
    max cardinality: 1
    on property: FamilyMemberHistory.deceasedBoolean
  union of: Restriction
    all values from: Age
    max cardinality: 1
    on property: FamilyMemberHistory.deceasedAge
  union of: Restriction
    all values from: Range
    max cardinality: 1
    on property: FamilyMemberHistory.deceasedRange
  union of: Restriction
    all values from: date
    max cardinality: 1
    on property: FamilyMemberHistory.deceasedDate
  union of: Restriction
    all values from: string
    max cardinality: 1
    on property: FamilyMemberHistory.deceasedString
subclass of: Restriction
  all values from: boolean
  max cardinality: 1
  on property: FamilyMemberHistory.estimatedAge
subclass of: Restriction
  all values from: canonical
  on property: FamilyMemberHistory.instantiatesCanonical
subclass of: Restriction
  all values from: CodeableConcept
  max cardinality: 1
  on property: FamilyMemberHistory.dataAbsentReason
subclass of: Restriction
  all values from: FamilyMemberHistoryConditionComponent
  on property: FamilyMemberHistory.condition
subclass of: Restriction
  all values from: Annotation
  on property: FamilyMemberHistory.note
subclass of: Restriction
  all values from: Reference
  on property: FamilyMemberHistory.reasonReference
subclass of: Restriction
  cardinality: 1
  on property: FamilyMemberHistory.patient
  some values from: Reference
subclass of: Restriction
  all values from: CodeableConcept
  max cardinality: 1
  on property: FamilyMemberHistory.gender
subclass of: Restriction
  cardinality: 1
  on property: FamilyMemberHistory.relationship
  some values from: CodeableConcept
subclass of: Restriction
  all values from: uri
  on property: FamilyMemberHistory.instantiatesUri
subclass of:
  union of: Restriction
    all values from: Period
    max cardinality: 1
    on property: FamilyMemberHistory.bornPeriod
  union of: Restriction
    all values from: date
    max cardinality: 1
    on property: FamilyMemberHistory.bornDate
  union of: Restriction
    all values from: string
    max cardinality: 1
    on property: FamilyMemberHistory.bornString
subclass of:
  union of: Restriction
    all values from: Age
    max cardinality: 1
    on property: FamilyMemberHistory.ageAge
  union of: Restriction
    all values from: Range
    max cardinality: 1
    on property: FamilyMemberHistory.ageRange
  union of: Restriction
    all values from: string
    max cardinality: 1
    on property: FamilyMemberHistory.ageString
subclass of: Restriction
  all values from: CodeableConcept
  on property: FamilyMemberHistory.reasonCode
subclass of: Restriction
  all values from: Identifier
  on property: FamilyMemberHistory.identifier
subclass of: Restriction
  cardinality: 1
  on property: FamilyMemberHistory.status
  some values from: code

AuditEvent.agent.name
type: ObjectProperty
comment: Human-meaningful name for the agent.
domain: AuditEventAgentComponent
range: string
sub property of: who
title: Human friendly name for the agent

Condition.stage.assessment
type: ObjectProperty
comment: Reference to a formal record of the evidence on which the staging assessment is based.
domain: ConditionStageComponent
range: Reference
title: Formal record of assessment

MedicinalProductPackagedPackageItemComponentPackageItemPackageItem
type: Class
comment: Allows containers within containers.
subclass of: BackboneElement
title: Allows containers within containers

MessageHeader.destination.name
type: ObjectProperty
comment: Human-readable name for the target system.
domain: MessageHeader.MessageDestinationComponent
range: string
title: Name of system

ExplanationOfBenefit.addItem.factor
type: ObjectProperty
comment: A real number that represents a multiplier used in determining the overall value of services delivered and/or goods received. The concept of a Factor allows for a discount or surcharge multiplier to be applied to a monetary amount.
domain: ExplanationOfBenefit.AddedItemComponent
range: decimal
title: Price scaling factor

Claim.item.detail.sequence
type: ObjectProperty
comment: A service line number.
domain: Claim.ItemComponent.DetailComponent
range: positiveInt
title: Service instance

HealthcareService.programName
type: ObjectProperty
comment: Program Names that can be used to categorize the service.
domain: HealthcareService
range: string
title: Program Names that categorize the service

MedicinalProductAuthorization
type: Class
comment: The regulatory authorization of a medicinal product.
subclass of: DomainResource
subclass of: clinical.general
subclass of: Restriction
  all values from: dateTime
  max cardinality: 1
  on property: MedicinalProductAuthorization.statusDate
subclass of: Restriction
  all values from: dateTime
  max cardinality: 1
  on property: MedicinalProductAuthorization.dateOfFirstAuthorization
subclass of: Restriction
  all values from: dateTime
  max cardinality: 1
  on property: MedicinalProductAuthorization.restoreDate
subclass of: Restriction
  all values from: CodeableConcept
  on property: MedicinalProductAuthorization.jurisdiction
subclass of: Restriction
  all values from: Period
  max cardinality: 1
  on property: MedicinalProductAuthorization.validityPeriod
subclass of: Restriction
  all values from: CodeableConcept
  max cardinality: 1
  on property: MedicinalProductAuthorization.legalStatusOfSupply
subclass of: Restriction
  all values from: CodeableConcept
  max cardinality: 1
  on property: MedicinalProductAuthorization.status
subclass of: Restriction
  all values from: Period
  max cardinality: 1
  on property: MedicinalProductAuthorization.dataExclusivityPeriod
subclass of: Restriction
  all values from: Reference
  max cardinality: 1
  on property: MedicinalProductAuthorization.subject
subclass of: Restriction
  all values from: Reference
  max cardinality: 1
  on property: MedicinalProductAuthorization.holder
subclass of: Restriction
  all values from: CodeableConcept
  on property: MedicinalProductAuthorization.country
subclass of: Restriction
  all values from: Reference
  max cardinality: 1
  on property: MedicinalProductAuthorization.regulator
subclass of: Restriction
  all values from: dateTime
  max cardinality: 1
  on property: MedicinalProductAuthorization.internationalBirthDate
subclass of: Restriction
  all values from: Identifier
  on property: MedicinalProductAuthorization.identifier
subclass of: Restriction
  all values from: MedicinalProductAuthorizationProcedureComponent
  max cardinality: 1
  on property: MedicinalProductAuthorization.procedure
subclass of: Restriction
  all values from: CodeableConcept
  max cardinality: 1
  on property: MedicinalProductAuthorization.legalBasis
subclass of: Restriction
  all values from: MedicinalProductAuthorizationJurisdictionalAuthorizationComponent
  on property: MedicinalProductAuthorization.jurisdictionalAuthorization

TestScript.metadata.capability.description
type: ObjectProperty
comment: Description of the capabilities that this test script is requiring the server to support.
domain: TestScriptMetadataComponent.TestScriptMetadataCapabilityComponent
range: string
title: The expected capabilities of the server

ProcessRequest.period
type: ObjectProperty
comment: A period of time during which the fulfilling resources would have been created.
domain: ProcessRequest
range: Period
title: Selection period

ExampleScenarioProcessComponent.ExampleScenarioProcessStepComponentProcess.ExampleScenarioProcessStepComponent.ExampleScenarioProcessStepAlternativeComponent.ExampleScenarioProcessStepAlternativeOptionComponentStep.ExampleScenarioProcessStepAlternativeComponent.ExampleScenarioProcessStepAlternativeOptionComponent
type: Class
comment: Each of the possible options in an alternative.
subclass of: BackboneElement
subclass of: Restriction
  all values from: boolean
  on property: ExampleScenario.process.step.process.step.alternative.option.step.alternative.option.pause
subclass of: Restriction
  all values from: ExampleScenarioProcessComponent.ExampleScenarioProcessStepComponentProcess.ExampleScenarioProcessStepComponent.ExampleScenarioProcessStepAlternativeComponent.ExampleScenarioProcessStepAlternativeOptionComponentStep.ExampleScenarioProcessStepAlternativeComponent.ExampleScenarioProcessStepAlternativeOptionComponentStep
  on property: ExampleScenario.process.step.process.step.alternative.option.step.alternative.option.step
subclass of: Restriction
  cardinality: 1
  on property: ExampleScenario.process.step.process.step.alternative.option.step.alternative.option.description
  some values from: markdown

Immunization.reasonReference
type: ObjectProperty
comment: Condition, Observation or DiagnosticReport that supports why the immunization was administered.
domain: Immunization
range: Reference
title: Why immunization occurred

ClaimResponse.ItemComponent
type: Class
comment: The first-tier service adjudications for submitted services.
subclass of: BackboneElement
subclass of: Restriction
  all values from: ClaimResponse.ItemComponent.ItemDetailComponent
  on property: ClaimResponse.item.detail
subclass of: Restriction
  all values from: ClaimResponse.ItemComponent.AdjudicationComponent
  on property: ClaimResponse.item.adjudication
subclass of: Restriction
  all values from: positiveInt
  on property: ClaimResponse.item.noteNumber
subclass of: Restriction
  cardinality: 1
  on property: ClaimResponse.item.itemSequence
  some values from: positiveInt

Claim.item.location
type: ObjectProperty

TestScript.test.action.assert.compareToSourceExpression
type: ObjectProperty
comment: The FHIRPath expression to evaluate against the source fixture. When compareToSourceId is defined, either compareToSourceExpression or compareToSourcePath must be defined, but not both.
domain: TestScriptTestComponent.TestActionComponentAssert
range: string
title: The FHIRPath expression to evaluate against the source fixture

OrganizationAffiliation.location
type: ObjectProperty
comment: The location(s) at which the role occurs.
domain: OrganizationAffiliation
range: Reference
sub property of: where
title: The location(s) at which the role occurs

SubstanceReferenceInformation.target.amountQuantity
type: ObjectProperty
domain: SubstanceReferenceInformationTargetComponent
range: Quantity
sub property of: SubstanceReferenceInformation.target.amount

TestScript.setup.action.assert.validateProfileId
type: ObjectProperty
comment: The ID of the Profile to validate against.
domain: TestScriptSetupComponent.SetupActionComponent.SetupActionAssertComponent
range: id
title: Profile Id of validation profile reference

RequestGroup.action.relatedAction.offset
type: ObjectProperty

Observation.component.valueTime
type: ObjectProperty
domain: ObservationComponentComponent
range: time
sub property of: Observation.component.value

DeviceDefinitionSpecializationComponent
type: Class
comment: The capabilities supported on a device, the standards to which the device conforms for a particular purpose, and used for the communication.
subclass of: BackboneElement
subclass of: Restriction
  all values from: string
  max cardinality: 1
  on property: DeviceDefinition.specialization.version
subclass of: Restriction
  cardinality: 1
  on property: DeviceDefinition.specialization.systemType
  some values from: string

InsurancePlan.type
type: ObjectProperty
comment: The kind of health insurance product.
domain: InsurancePlan
range: CodeableConcept
sub property of: class
title: Kind of product

Questionnaire.item.item.answerOption.valueCoding
type: ObjectProperty
domain: QuestionnaireItemComponentItem.QuestionnaireItemAnswerOptionComponent
range: Coding
sub property of: Questionnaire.item.item.answerOption.value

Person.telecom
type: ObjectProperty
comment: A contact detail for the person, e.g. a telephone number or an email address.
domain: Person
range: ContactPoint
title: A contact detail for the person

ActivityDefinition.publisher
type: ObjectProperty
comment: The name of the organization or individual that published the activity definition.
domain: ActivityDefinition
range: string
sub property of: who.witness
title: Name of the publisher (organization or individual)

SubstanceReferenceInformation.gene
type: ObjectProperty
comment: Todo.
domain: SubstanceReferenceInformation
range: SubstanceReferenceInformationGeneComponent
title: Todo

SubstanceReferenceInformationClassificationComponent
type: Class
comment: Todo.
subclass of: BackboneElement
subclass of: Restriction
  all values from: Reference
  on property: SubstanceReferenceInformation.classification.source
subclass of: Restriction
  all values from: CodeableConcept
  on property: SubstanceReferenceInformation.classification.subtype
subclass of: Restriction
  all values from: CodeableConcept
  max cardinality: 1
  on property: SubstanceReferenceInformation.classification.classification
subclass of: Restriction
  all values from: CodeableConcept
  max cardinality: 1
  on property: SubstanceReferenceInformation.classification.domain

MessageDefinition.responseRequired
type: ObjectProperty
comment: Declare at a message definition level whether a response is required or only upon error or success, or never.
domain: MessageDefinition
range: code
title: always | on-error | never | on-success

Sequence.structureVariant.outer.start
type: ObjectProperty
comment: Structural Variant Outer Start.If the coordinate system is either 0-based or 1-based, then start position is inclusive.
domain: SequenceStructureVariantComponent.SequenceStructureVariantOuterComponent
range: integer
title: Structural Variant Outer Start

Resource.meta
type: ObjectProperty
comment: The metadata about the resource. This is content that is maintained by the infrastructure. Changes to the content might not always be associated with version changes to the resource.
domain: Resource
range: Meta
title: Metadata about the resource

MedicinalProductManufactured.physicalCharacteristics
type: ObjectProperty
comment: Dimensions, color etc.
domain: MedicinalProductManufactured
range: ProdCharacteristic
title: Dimensions, color etc.

DeviceDefinitionDeviceNameComponent
type: Class
comment: A name given to the device to identify it.
subclass of: BackboneElement
subclass of: Restriction
  cardinality: 1
  on property: DeviceDefinition.deviceName.type
  some values from: code
subclass of: Restriction
  cardinality: 1
  on property: DeviceDefinition.deviceName.name
  some values from: string

Device.lotNumber
type: ObjectProperty
comment: Lot number assigned by the manufacturer.
domain: Device
range: string
sub property of: what
title: Lot number of manufacture

CapabilityStatement.messaging.supportedMessage.definition
type: ObjectProperty
comment: Points to a message definition that identifies the messaging event, message structure, allowed responses, etc.
domain: CapabilityStatementMessagingComponent.CapabilityStatementMessagingSupportedMessageComponent
range: canonical
title: Message supported by this system

Claim.AccidentComponent
type: Class
comment: An accident which resulted in the need for healthcare services.
subclass of: BackboneElement
subclass of:
  union of: Restriction
    all values from: Address
    max cardinality: 1
    on property: Claim.accident.locationAddress
  union of: Restriction
    all values from: Reference
    max cardinality: 1
    on property: Claim.accident.locationReference
subclass of: Restriction
  all values from: CodeableConcept
  max cardinality: 1
  on property: Claim.accident.type
subclass of: Restriction
  cardinality: 1
  on property: Claim.accident.date
  some values from: date

Observation.method
type: ObjectProperty
comment: Indicates the mechanism used to perform the observation.
domain: Observation
range: CodeableConcept
title: How it was done

MedicationRequest.medication
type: ObjectProperty

Invoice.totalNet
type: ObjectProperty
comment: Invoice total , taxes excluded.
domain: Invoice
range: Money
title: Net total of this Invoice

Contract.TermComponentTerm.ContractAssetComponent
type: Class
comment: Contract Term Asset List.
subclass of: BackboneElement
subclass of: Restriction
  all values from: Period
  on property: Contract.term.group.asset.usePeriod
subclass of: Restriction
  all values from: CodeableConcept
  on property: Contract.term.group.asset.type
subclass of: Restriction
  all values from: string
  max cardinality: 1
  on property: Contract.term.group.asset.text
subclass of: Restriction
  all values from: Reference
  on property: Contract.term.group.asset.typeReference
subclass of: Restriction
  all values from: CodeableConcept
  max cardinality: 1
  on property: Contract.term.group.asset.scope
subclass of: Restriction
  all values from: Contract.TermComponentTerm.ContractAssetComponent.AssetContextComponent
  on property: Contract.term.group.asset.context
subclass of: Restriction
  all values from: CodeableConcept
  on property: Contract.term.group.asset.subtype
subclass of: Restriction
  all values from: string
  max cardinality: 1
  on property: Contract.term.group.asset.condition
subclass of: Restriction
  all values from: Coding
  max cardinality: 1
  on property: Contract.term.group.asset.relationship
subclass of: Restriction
  all values from: string
  on property: Contract.term.group.asset.linkId
subclass of: Restriction
  all values from: Contract.TermComponentTerm.ContractAssetComponent.ValuedItemComponent
  on property: Contract.term.group.asset.valuedItem
subclass of: Restriction
  all values from: CodeableConcept
  on property: Contract.term.group.asset.periodType
subclass of: Restriction
  all values from: Contract.TermComponentTerm.ContractAssetComponentAnswer
  on property: Contract.term.group.asset.answer
subclass of: Restriction
  all values from: unsignedInt
  on property: Contract.term.group.asset.securityLabelNumber
subclass of: Restriction
  all values from: Period
  on property: Contract.term.group.asset.period

Media.createdDateTime
type: ObjectProperty
domain: Media
range: dateTime
sub property of: Media.created

CodeSystem.ConceptDefinitionComponentConceptConcept
type: Class
comment: Defines children of a concept to produce a hierarchy of concepts. The nature of the relationships is variable (is-a/contains/categorizes) - see hierarchyMeaning.
subclass of: BackboneElement
title: Child Concepts (is-a/contains/categorizes)